sling-commits mailing list archives

Site index · List index
Message view « Date » · « Thread »
Top « Date » · « Thread »
From Apache Jenkins Server <jenk...@builds.apache.org>
Subject Build failed in Jenkins: sling-contrib-extensions-contextaware-config-impl-1.7 #28
Date Mon, 07 Nov 2016 10:34:25 GMT
See <https://builds.apache.org/job/sling-contrib-extensions-contextaware-config-impl-1.7/28/changes>

Changes:

[cziegeler] Switch to SPI 1.1.1-SNAPSHOT during release

[cziegeler] [maven-release-plugin] prepare for next development iteration

[cziegeler] [maven-release-plugin] prepare release org.apache.sling.caconfig.impl-1.1.0

[cziegeler] Use SPI 1.1.0

------------------------------------------
Started by an SCM change
[EnvInject] - Loading node environment variables.
Building remotely on H10 (Ubuntu yahoo-not-h2 ubuntu docker) in workspace <https://builds.apache.org/job/sling-contrib-extensions-contextaware-config-impl-1.7/ws/>
Updating https://svn.apache.org/repos/asf/sling/trunk/contrib/extensions/contextaware-config/impl
at revision '2016-11-07T10:33:22.488 +0000'
U         pom.xml
At revision 1768485

Parsing POMs
Modules changed, recalculating dependency graph
Established TCP socket on 32991
maven32-agent.jar already up to date
maven32-interceptor.jar already up to date
maven3-interceptor-commons.jar already up to date
[sling-contrib-extensions-contextaware-config-impl-1.7] $ /home/jenkins/tools/java/latest1.7/bin/java
-Xmx2g -Xms256m -XX:MaxPermSize=512m -cp /home/jenkins/jenkins-slave/maven32-agent.jar:/home/jenkins/tools/maven/apache-maven-3.3.9/boot/plexus-classworlds-2.5.2.jar:/home/jenkins/tools/maven/apache-maven-3.3.9/conf/logging
jenkins.maven3.agent.Maven32Main /home/jenkins/tools/maven/apache-maven-3.3.9 /home/jenkins/jenkins-slave/slave.jar
/home/jenkins/jenkins-slave/maven32-interceptor.jar /home/jenkins/jenkins-slave/maven3-interceptor-commons.jar
32991
<===[JENKINS REMOTING CAPACITY]===>   channel started
Executing Maven:  -B -f <https://builds.apache.org/job/sling-contrib-extensions-contextaware-config-impl-1.7/ws/pom.xml>
-Dmaven.repo.local=/home/jenkins/jenkins-slave/maven-repositories/0 -U clean deploy
[INFO] Scanning for projects...
[INFO]                                                                         
[INFO] ------------------------------------------------------------------------
[INFO] Building Apache Sling Context-Aware Configuration Implementation 1.1.1-SNAPSHOT
[INFO] ------------------------------------------------------------------------
[INFO] Downloading: http://repository.apache.org/snapshots/org/apache/sling/org.apache.sling.caconfig.spi/1.1.1-SNAPSHOT/maven-metadata.xml
[INFO] Downloading: http://repository.apache.org/snapshots/org/apache/sling/org.apache.sling.caconfig.spi/1.1.1-SNAPSHOT/org.apache.sling.caconfig.spi-1.1.1-SNAPSHOT.pom
[WARNING] The POM for org.apache.sling:org.apache.sling.caconfig.spi:jar:1.1.1-SNAPSHOT is
missing, no dependency information available
[INFO] Downloading: http://repository.apache.org/snapshots/org/apache/sling/org.apache.sling.caconfig.spi/1.1.1-SNAPSHOT/org.apache.sling.caconfig.spi-1.1.1-SNAPSHOT.jar
[JENKINS] Archiving disabled
[JENKINS] Archiving disabled[INFO] ------------------------------------------------------------------------
[INFO] BUILD FAILURE
[INFO] ------------------------------------------------------------------------
[INFO] Total time: 5.093 s
[INFO] Finished at: 2016-11-07T10:32:33+00:00

[INFO] Final Memory: 18M/310M
[INFO] ------------------------------------------------------------------------
[ERROR] Failed to execute goal on project org.apache.sling.caconfig.impl: Could not resolve
dependencies for project org.apache.sling:org.apache.sling.caconfig.impl:bundle:1.1.1-SNAPSHOT:
Could not find artifact org.apache.sling:org.apache.sling.caconfig.spi:jar:1.1.1-SNAPSHOT
in Nexus (http://repository.apache.org/snapshots) -> [Help 1]
[ERROR] 
[ERROR] To see the full stack trace of the errors, re-run Maven with the -e switch.
[ERROR] Re-run Maven using the -X switch to enable full debug logging.
[ERROR] 
[ERROR] For more information about the errors and possible solutions, please read the following
articles:
[ERROR] [Help 1] http://cwiki.apache.org/confluence/display/MAVEN/DependencyResolutionException
channel stopped
Recording test results
ERROR: Step ?Publish JUnit test result report? failed: Test reports were found but none of
them are new. Did tests run? 
For example, <https://builds.apache.org/job/sling-contrib-extensions-contextaware-config-impl-1.7/ws/target/surefire-reports/TEST-org.apache.sling.caconfig.impl.ConfigurationBuilderAdapterFactoryTest.xml>
is 25 min old



Mime
View raw message