sling-commits mailing list archives

Site index · List index
Message view « Date » · « Thread »
Top « Date » · « Thread »
From Apache Jenkins Server <jenk...@builds.apache.org>
Subject Build failed in Jenkins: sling-bundles-scripting-core-1.8 #17
Date Mon, 28 Nov 2016 18:27:16 GMT
See <https://builds.apache.org/job/sling-bundles-scripting-core-1.8/17/>

------------------------------------------
Started by upstream project "sling-bundles-scripting-api-1.7" build number 8
originally caused by:
 Started by an SCM change
[EnvInject] - Loading node environment variables.
Building remotely on H15 (ubuntu) in workspace <https://builds.apache.org/job/sling-bundles-scripting-core-1.8/ws/>
Updating https://svn.apache.org/repos/asf/sling/trunk/bundles/scripting/core at revision '2016-11-28T18:26:38.721
+0000'
At revision 1771787

No changes for https://svn.apache.org/repos/asf/sling/trunk/bundles/scripting/core since the
previous build
Parsing POMs
Established TCP socket on 39571
maven32-agent.jar already up to date
maven32-interceptor.jar already up to date
maven3-interceptor-commons.jar already up to date
[sling-bundles-scripting-core-1.8] $ /home/jenkins/tools/java/latest1.8/bin/java -Xmx2g -Xms256m
-XX:MaxPermSize=512m -cp /home/jenkins/jenkins-slave/maven32-agent.jar:/home/jenkins/tools/maven/apache-maven-3.3.9/boot/plexus-classworlds-2.5.2.jar:/home/jenkins/tools/maven/apache-maven-3.3.9/conf/logging
jenkins.maven3.agent.Maven32Main /home/jenkins/tools/maven/apache-maven-3.3.9 /home/jenkins/jenkins-slave/slave.jar
/home/jenkins/jenkins-slave/maven32-interceptor.jar /home/jenkins/jenkins-slave/maven3-interceptor-commons.jar
39571
Java HotSpot(TM) 64-Bit Server VM warning: ignoring option MaxPermSize=512m; support was removed
in 8.0
<===[JENKINS REMOTING CAPACITY]===>   channel started
Executing Maven:  -B -f <https://builds.apache.org/job/sling-bundles-scripting-core-1.8/ws/pom.xml>
-Dmaven.repo.local=/home/jenkins/jenkins-slave/maven-repositories/1 -U clean verify
[INFO] Scanning for projects...
[INFO]                                                                         
[INFO] ------------------------------------------------------------------------
[INFO] Building Apache Sling Scripting Core implementation 2.0.43-SNAPSHOT
[INFO] ------------------------------------------------------------------------
[INFO] Downloading: http://repository.apache.org/snapshots/org/apache/sling/org.apache.sling.api/2.15.1-SNAPSHOT/maven-metadata.xml
[INFO] Downloaded: http://repository.apache.org/snapshots/org/apache/sling/org.apache.sling.api/2.15.1-SNAPSHOT/maven-metadata.xml
(1004 B at 2.2 KB/sec)
[INFO] Downloading: http://repository.apache.org/snapshots/org/apache/sling/org.apache.sling.scripting.api/2.1.11-SNAPSHOT/maven-metadata.xml
[INFO] Downloaded: http://repository.apache.org/snapshots/org/apache/sling/org.apache.sling.scripting.api/2.1.11-SNAPSHOT/maven-metadata.xml
(1014 B at 2.6 KB/sec)
[INFO] Downloading: http://repository.apache.org/snapshots/org/apache/sling/org.apache.sling.scripting.api/2.1.11-SNAPSHOT/org.apache.sling.scripting.api-2.1.11-20161128.182453-3.pom
[INFO] Downloaded: http://repository.apache.org/snapshots/org/apache/sling/org.apache.sling.scripting.api/2.1.11-SNAPSHOT/org.apache.sling.scripting.api-2.1.11-20161128.182453-3.pom
(3 KB at 6.6 KB/sec)
[INFO] Downloading: http://repository.apache.org/snapshots/org/apache/sling/org.apache.sling.scripting.api/2.1.11-SNAPSHOT/org.apache.sling.scripting.api-2.1.11-20161128.182453-3.jar
[INFO] Downloaded: http://repository.apache.org/snapshots/org/apache/sling/org.apache.sling.scripting.api/2.1.11-SNAPSHOT/org.apache.sling.scripting.api-2.1.11-20161128.182453-3.jar
(18 KB at 38.3 KB/sec)
[INFO] 
[INFO] --- maven-clean-plugin:3.0.0:clean (default-clean) @ org.apache.sling.scripting.core
---
[INFO] Deleting <https://builds.apache.org/job/sling-bundles-scripting-core-1.8/ws/target>
[INFO] 
[INFO] --- maven-enforcer-plugin:1.4.1:enforce (enforce-java) @ org.apache.sling.scripting.core
---
[INFO] 
[INFO] --- maven-antrun-plugin:1.8:run (set-bundle-required-execution-environment) @ org.apache.sling.scripting.core
---
[INFO] Executing tasks

main:
Setting Bundle-RequiredExecutionEnvironment=JavaSE-1.7 from sling.java.version=7
[INFO] Executed tasks
[INFO] 
[INFO] --- maven-remote-resources-plugin:1.5:process (process-resource-bundles) @ org.apache.sling.scripting.core
---
[INFO] 
[INFO] --- maven-remote-resources-plugin:1.5:process (default) @ org.apache.sling.scripting.core
---
[INFO] 
[INFO] --- depends-maven-plugin:1.2:generate-depends-file (default) @ org.apache.sling.scripting.core
---
[INFO] Created: <https://builds.apache.org/job/sling-bundles-scripting-core-1.8/ws/target/classes/META-INF/maven/dependencies.properties>
[INFO] 
[INFO] --- maven-resources-plugin:2.7:resources (default-resources) @ org.apache.sling.scripting.core
---
[INFO] Using 'UTF-8' encoding to copy filtered resources.
[INFO] Copying 1 resource
[INFO] Copying 3 resources
[INFO] Copying 3 resources
[INFO] 
[INFO] --- maven-compiler-plugin:3.5.1:compile (default-compile) @ org.apache.sling.scripting.core
---
[INFO] Changes detected - recompiling the module!
[INFO] Compiling 27 source files to <https://builds.apache.org/job/sling-bundles-scripting-core-1.8/ws/target/classes>
[INFO] <https://builds.apache.org/job/sling-bundles-scripting-core-1.8/ws/src/main/java/org/apache/sling/scripting/core/impl/BindingsValuesProvidersByContextImpl.java>:
Some input files use unchecked or unsafe operations.
[INFO] <https://builds.apache.org/job/sling-bundles-scripting-core-1.8/ws/src/main/java/org/apache/sling/scripting/core/impl/BindingsValuesProvidersByContextImpl.java>:
Recompile with -Xlint:unchecked for details.
[INFO] -------------------------------------------------------------
[ERROR] COMPILATION ERROR : 
[INFO] -------------------------------------------------------------
[ERROR] <https://builds.apache.org/job/sling-bundles-scripting-core-1.8/ws/src/main/java/org/apache/sling/scripting/core/impl/ScriptingResourceResolver.java>:[26,37]
cannot find symbol
  symbol:   class ResourceResolverWrapper
  location: package org.apache.sling.api.resource
[ERROR] <https://builds.apache.org/job/sling-bundles-scripting-core-1.8/ws/src/main/java/org/apache/sling/scripting/core/impl/ScriptingResourceResolver.java>:[31,48]
cannot find symbol
  symbol: class ResourceResolverWrapper
[ERROR] <https://builds.apache.org/job/sling-bundles-scripting-core-1.8/ws/src/main/java/org/apache/sling/scripting/core/impl/ScriptingResourceResolver.java>:[45,5]
method does not override or implement a method from a supertype
[ERROR] <https://builds.apache.org/job/sling-bundles-scripting-core-1.8/ws/src/main/java/org/apache/sling/scripting/core/impl/ScriptingResourceResolver.java>:[47,16]
incompatible types: org.apache.sling.scripting.core.impl.ScriptingResourceResolver cannot
be converted to org.apache.sling.api.resource.ResourceResolver
[ERROR] <https://builds.apache.org/job/sling-bundles-scripting-core-1.8/ws/src/main/java/org/apache/sling/scripting/core/impl/ScriptingResourceResolver.java>:[50,5]
method does not override or implement a method from a supertype
[ERROR] <https://builds.apache.org/job/sling-bundles-scripting-core-1.8/ws/src/main/java/org/apache/sling/scripting/core/impl/ScriptingResourceResolverProviderImpl.java>:[92,16]
incompatible types: org.apache.sling.scripting.core.impl.ScriptingResourceResolver cannot
be converted to org.apache.sling.api.resource.ResourceResolver
[INFO] 6 errors 
[INFO] -------------------------------------------------------------
[JENKINS] Archiving disabled
[JENKINS] Archiving disabled[INFO] ------------------------------------------------------------------------
[INFO] BUILD FAILURE
[INFO] ------------------------------------------------------------------------
[INFO] Total time: 12.690 s
[INFO] Finished at: 2016-11-28T18:45:21+00:00

[INFO] Final Memory: 39M/537M
[INFO] ------------------------------------------------------------------------
Waiting for Jenkins to finish collecting data
[ERROR] Failed to execute goal org.apache.maven.plugins:maven-compiler-plugin:3.5.1:compile
(default-compile) on project org.apache.sling.scripting.core: Compilation failure: Compilation
failure:
[ERROR] <https://builds.apache.org/job/sling-bundles-scripting-core-1.8/ws/src/main/java/org/apache/sling/scripting/core/impl/ScriptingResourceResolver.java>:[26,37]
cannot find symbol
[ERROR] symbol:   class ResourceResolverWrapper
[ERROR] location: package org.apache.sling.api.resource
[ERROR] <https://builds.apache.org/job/sling-bundles-scripting-core-1.8/ws/src/main/java/org/apache/sling/scripting/core/impl/ScriptingResourceResolver.java>:[31,48]
cannot find symbol
[ERROR] symbol: class ResourceResolverWrapper
[ERROR] <https://builds.apache.org/job/sling-bundles-scripting-core-1.8/ws/src/main/java/org/apache/sling/scripting/core/impl/ScriptingResourceResolver.java>:[45,5]
method does not override or implement a method from a supertype
[ERROR] <https://builds.apache.org/job/sling-bundles-scripting-core-1.8/ws/src/main/java/org/apache/sling/scripting/core/impl/ScriptingResourceResolver.java>:[47,16]
incompatible types: org.apache.sling.scripting.core.impl.ScriptingResourceResolver cannot
be converted to org.apache.sling.api.resource.ResourceResolver
[ERROR] <https://builds.apache.org/job/sling-bundles-scripting-core-1.8/ws/src/main/java/org/apache/sling/scripting/core/impl/ScriptingResourceResolver.java>:[50,5]
method does not override or implement a method from a supertype
[ERROR] <https://builds.apache.org/job/sling-bundles-scripting-core-1.8/ws/src/main/java/org/apache/sling/scripting/core/impl/ScriptingResourceResolverProviderImpl.java>:[92,16]
incompatible types: org.apache.sling.scripting.core.impl.ScriptingResourceResolver cannot
be converted to org.apache.sling.api.resource.ResourceResolver
[ERROR] -> [Help 1]
[ERROR] 
[ERROR] To see the full stack trace of the errors, re-run Maven with the -e switch.
[ERROR] Re-run Maven using the -X switch to enable full debug logging.
[ERROR] 
[ERROR] For more information about the errors and possible solutions, please read the following
articles:
[ERROR] [Help 1] http://cwiki.apache.org/confluence/display/MAVEN/MojoFailureException
channel stopped
Recording test results

Mime
View raw message