sling-commits mailing list archives

Site index · List index
Message view « Date » · « Thread »
Top « Date » · « Thread »
From Apache Jenkins Server <jenk...@builds.apache.org>
Subject Build failed in Jenkins: sling-bundles-extensions-models-integration-tests-1.7 #5
Date Tue, 01 Nov 2016 00:09:13 GMT
See <https://builds.apache.org/job/sling-bundles-extensions-models-integration-tests-1.7/5/>

------------------------------------------
Started by upstream project "sling-bundles-extensions-models-impl-1.7" build number 5
originally caused by:
 Started by an SCM change
[EnvInject] - Loading node environment variables.
Building remotely on ubuntu-eu2 (Ubuntu ubuntu ubuntu-eu docker) in workspace <https://builds.apache.org/job/sling-bundles-extensions-models-integration-tests-1.7/ws/>
Checking out a fresh workspace because there's no workspace at <https://builds.apache.org/job/sling-bundles-extensions-models-integration-tests-1.7/ws/>
Cleaning local Directory .
Checking out https://svn.apache.org/repos/asf/sling/trunk/bundles/extensions/models/integration-tests
at revision '2016-11-01T00:08:16.966 +0000'
A         src
A         src/test
A         src/test/java
A         src/test/java/org
A         src/test/java/org/apache
A         src/test/java/org/apache/sling
A         src/test/java/org/apache/sling/models
A         src/test/java/org/apache/sling/models/it
A         src/test/java/org/apache/sling/models/it/RemoteIT.java
A         src/main
A         src/main/resources
A         src/main/resources/org
A         src/main/resources/org/apache
A         src/main/resources/org/apache/sling
A         src/main/resources/org/apache/sling/models
A         src/main/resources/org/apache/sling/models/it
A         src/main/resources/org/apache/sling/models/it/noclasses
A         src/main/resources/org/apache/sling/models/it/noclasses/foo.txt
A         src/main/java
A         src/main/java/org
A         src/main/java/org/apache
A         src/main/java/org/apache/sling
A         src/main/java/org/apache/sling/models
A         src/main/java/org/apache/sling/models/it
A         src/main/java/org/apache/sling/models/it/ModelFactorySimpleTest.java
A         src/main/java/org/apache/sling/models/it/models
A         src/main/java/org/apache/sling/models/it/models/InterfaceInjectionTestModel.java
AU        src/main/java/org/apache/sling/models/it/models/ServiceInjectionTestModel.java
A         src/main/java/org/apache/sling/models/it/models/FieldInjectionTestModel.java
A         src/main/java/org/apache/sling/models/it/models/SourceObject.java
A         src/main/java/org/apache/sling/models/it/models/ConstructorInjectionTestModel.java
A         src/main/java/org/apache/sling/models/it/models/implextend
A         src/main/java/org/apache/sling/models/it/models/implextend/SimplePropertyModel.java
A         src/main/java/org/apache/sling/models/it/models/implextend/SampleServiceInterface.java
A         src/main/java/org/apache/sling/models/it/models/implextend/ImplementsInterfacePropertyModel.java
A         src/main/java/org/apache/sling/models/it/models/implextend/ExtendsClassPropertyModel.java
A         src/main/java/org/apache/sling/models/it/models/implextend/ImplementsInterfacePropertyModel2.java
A         src/main/java/org/apache/sling/models/it/models/implextend/InvalidSampleServiceInterface.java
A         src/main/java/org/apache/sling/models/it/models/implextend/InvalidImplementsInterfacePropertyModel.java
A         src/main/java/org/apache/sling/models/it/models/SlingPropertyAnnotationTestModel.java
A         src/main/java/org/apache/sling/models/it/models/ViaModel.java
A         src/main/java/org/apache/sling/models/it/services
AU        src/main/java/org/apache/sling/models/it/services/SimpleService.java
AU        src/main/java/org/apache/sling/models/it/services/SimpleServiceWithCustomRanking.java
A         src/main/java/org/apache/sling/models/it/ImplementsExtendsTest.java
A         src/main/java/org/apache/sling/models/it/exporter
A         src/main/java/org/apache/sling/models/it/exporter/ExporterTest.java
A         src/main/java/org/apache/sling/models/it/exporter/BaseComponent.java
A         src/main/java/org/apache/sling/models/it/exporter/FakeRequest.java
A         src/main/java/org/apache/sling/models/it/exporter/ExtendedComponent.java
A         src/main/java/org/apache/sling/models/it/exporter/FakeResponse.java
A         src/main/java/org/apache/sling/models/it/SimpleTest.java
A         src/main/java/org/apache/sling/models/it/rtboundpicker
A         src/main/java/org/apache/sling/models/it/rtboundpicker/SubRTComponent.java
A         src/main/java/org/apache/sling/models/it/rtboundpicker/TestComponent.java
A         src/main/java/org/apache/sling/models/it/rtboundpicker/ResourceTypePickerTest.java
A         src/main/java/org/apache/sling/models/it/rtboundpicker/BaseComponent.java
A         src/main/java/org/apache/sling/models/it/rtbound
A         src/main/java/org/apache/sling/models/it/rtbound/BaseComponent.java
A         src/main/java/org/apache/sling/models/it/rtbound/FakeRequest.java
A         src/main/java/org/apache/sling/models/it/rtbound/FromRequestComponent.java
A         src/main/java/org/apache/sling/models/it/rtbound/ExtendedComponent.java
A         src/main/java/org/apache/sling/models/it/rtbound/ResourceTypeBindingTest.java
A         src/main/java/org/apache/sling/models/it/InjectorSpecificAnnotationTest.java
A         src/main/java/org/apache/sling/models/it/ViaTest.java
A         src/main/java/org/apache/sling/models/it/implpicker
A         src/main/java/org/apache/sling/models/it/implpicker/CustomLastImplementationPicker.java
AU        src/main/java/org/apache/sling/models/it/ServiceInjectionWithDifferentRankingTest.java
A         pom.xml
 U        .
At revision 1767395

No changes for https://svn.apache.org/repos/asf/sling/trunk/bundles/extensions/models/integration-tests
since the previous build
Parsing POMs
Established TCP socket on 42054
maven32-agent.jar already up to date
maven32-interceptor.jar already up to date
maven3-interceptor-commons.jar already up to date
[sling-bundles-extensions-models-integration-tests-1.7] $ /home/jenkins/tools/java/latest1.7/bin/java
-Xmx2g -Xms256m -XX:MaxPermSize=512m -cp /home/jenkins/jenkins-slave/maven32-agent.jar:/home/jenkins/tools/maven/apache-maven-3.3.9/boot/plexus-classworlds-2.5.2.jar:/home/jenkins/tools/maven/apache-maven-3.3.9/conf/logging
jenkins.maven3.agent.Maven32Main /home/jenkins/tools/maven/apache-maven-3.3.9 /home/jenkins/jenkins-slave/slave.jar
/home/jenkins/jenkins-slave/maven32-interceptor.jar /home/jenkins/jenkins-slave/maven3-interceptor-commons.jar
42054
<===[JENKINS REMOTING CAPACITY]===>   channel started
Executing Maven:  -B -f <https://builds.apache.org/job/sling-bundles-extensions-models-integration-tests-1.7/ws/pom.xml>
-Dmaven.repo.local=/home/jenkins/jenkins-slave/maven-repositories/1 -U clean deploy
[INFO] Scanning for projects...
[INFO]                                                                         
[INFO] ------------------------------------------------------------------------
[INFO] Building Apache Sling Models Integration Tests 0.0.1-SNAPSHOT
[INFO] ------------------------------------------------------------------------
[INFO] Downloading: https://repo.maven.apache.org/maven2/org/apache/sling/org.apache.sling.junit.core/1.0.8/org.apache.sling.junit.core-1.0.8.pom
[INFO] Downloaded: https://repo.maven.apache.org/maven2/org/apache/sling/org.apache.sling.junit.core/1.0.8/org.apache.sling.junit.core-1.0.8.pom
(5 KB at 11.2 KB/sec)
[INFO] Downloading: https://repo.maven.apache.org/maven2/org/apache/sling/org.apache.sling.junit.remote/1.0.8/org.apache.sling.junit.remote-1.0.8.pom
[INFO] Downloaded: https://repo.maven.apache.org/maven2/org/apache/sling/org.apache.sling.junit.remote/1.0.8/org.apache.sling.junit.remote-1.0.8.pom
(5 KB at 134.2 KB/sec)
[INFO] Downloading: https://repo.maven.apache.org/maven2/org/apache/sling/org.apache.sling.testing.tools/1.0.12/org.apache.sling.testing.tools-1.0.12.pom
[INFO] Downloaded: https://repo.maven.apache.org/maven2/org/apache/sling/org.apache.sling.testing.tools/1.0.12/org.apache.sling.testing.tools-1.0.12.pom
(5 KB at 121.0 KB/sec)
[INFO] Downloading: https://repo.maven.apache.org/maven2/org/apache/sling/org.apache.sling.engine/2.2.0/org.apache.sling.engine-2.2.0.pom
[INFO] Downloaded: https://repo.maven.apache.org/maven2/org/apache/sling/org.apache.sling.engine/2.2.0/org.apache.sling.engine-2.2.0.pom
(7 KB at 32.5 KB/sec)
[INFO] Downloading: http://repository.apache.org/snapshots/org/apache/sling/org.apache.sling.models.api/1.3.1-SNAPSHOT/maven-metadata.xml
[INFO] Downloaded: http://repository.apache.org/snapshots/org/apache/sling/org.apache.sling.models.api/1.3.1-SNAPSHOT/maven-metadata.xml
(1007 B at 2.5 KB/sec)
[INFO] Downloading: http://repository.apache.org/snapshots/org/apache/sling/org.apache.sling.models.api/1.3.1-SNAPSHOT/org.apache.sling.models.api-1.3.1-20161030.234806-1.pom
[INFO] Downloaded: http://repository.apache.org/snapshots/org/apache/sling/org.apache.sling.models.api/1.3.1-SNAPSHOT/org.apache.sling.models.api-1.3.1-20161030.234806-1.pom
(4 KB at 9.0 KB/sec)
[INFO] Downloading: http://repository.apache.org/snapshots/org/apache/sling/org.apache.sling.models.impl/1.3.1-SNAPSHOT/maven-metadata.xml
[INFO] Downloaded: http://repository.apache.org/snapshots/org/apache/sling/org.apache.sling.models.impl/1.3.1-SNAPSHOT/maven-metadata.xml
(1008 B at 2.6 KB/sec)
[INFO] Downloading: http://repository.apache.org/snapshots/org/apache/sling/org.apache.sling.models.impl/1.3.1-SNAPSHOT/org.apache.sling.models.impl-1.3.1-20161101.000618-1.pom
[INFO] Downloaded: http://repository.apache.org/snapshots/org/apache/sling/org.apache.sling.models.impl/1.3.1-SNAPSHOT/org.apache.sling.models.impl-1.3.1-20161101.000618-1.pom
(7 KB at 16.0 KB/sec)
[INFO] Downloading: http://repository.apache.org/snapshots/org/apache/sling/org.apache.sling.models.jacksonexporter/1.0.1-SNAPSHOT/maven-metadata.xml
[INFO] Downloading: http://repository.apache.org/snapshots/org/apache/sling/org.apache.sling.models.jacksonexporter/1.0.1-SNAPSHOT/org.apache.sling.models.jacksonexporter-1.0.1-SNAPSHOT.pom
[WARNING] The POM for org.apache.sling:org.apache.sling.models.jacksonexporter:jar:1.0.1-SNAPSHOT
is missing, no dependency information available
[INFO] Downloading: https://repo.maven.apache.org/maven2/com/fasterxml/jackson/core/jackson-annotations/2.3.2/jackson-annotations-2.3.2.pom
[INFO] Downloaded: https://repo.maven.apache.org/maven2/com/fasterxml/jackson/core/jackson-annotations/2.3.2/jackson-annotations-2.3.2.pom
(2 KB at 47.6 KB/sec)
[INFO] Downloading: https://repo.maven.apache.org/maven2/org/apache/httpcomponents/httpclient-osgi/4.1.2/httpclient-osgi-4.1.2.pom
[INFO] Downloaded: https://repo.maven.apache.org/maven2/org/apache/httpcomponents/httpclient-osgi/4.1.2/httpclient-osgi-4.1.2.pom
(7 KB at 32.2 KB/sec)
[INFO] Downloading: https://repo.maven.apache.org/maven2/org/apache/httpcomponents/httpclient-cache/4.1.2/httpclient-cache-4.1.2.pom
[INFO] Downloaded: https://repo.maven.apache.org/maven2/org/apache/httpcomponents/httpclient-cache/4.1.2/httpclient-cache-4.1.2.pom
(7 KB at 168.5 KB/sec)
[INFO] Downloading: https://repo.maven.apache.org/maven2/org/apache/httpcomponents/httpcore-osgi/4.1.2/httpcore-osgi-4.1.2.pom
[INFO] Downloaded: https://repo.maven.apache.org/maven2/org/apache/httpcomponents/httpcore-osgi/4.1.2/httpcore-osgi-4.1.2.pom
(4 KB at 111.1 KB/sec)
[INFO] Downloading: https://repo.maven.apache.org/maven2/org/apache/httpcomponents/httpcore-nio/4.1.2/httpcore-nio-4.1.2.pom
[INFO] Downloaded: https://repo.maven.apache.org/maven2/org/apache/httpcomponents/httpcore-nio/4.1.2/httpcore-nio-4.1.2.pom
(6 KB at 133.5 KB/sec)
[INFO] Downloading: https://repo.maven.apache.org/maven2/org/apache/sling/org.apache.sling.junit.core/1.0.8/org.apache.sling.junit.core-1.0.8.jar
[INFO] Downloading: https://repo.maven.apache.org/maven2/org/apache/sling/org.apache.sling.junit.remote/1.0.8/org.apache.sling.junit.remote-1.0.8.jar
[INFO] Downloading: https://repo.maven.apache.org/maven2/com/fasterxml/jackson/core/jackson-annotations/2.3.2/jackson-annotations-2.3.2.jar
[INFO] Downloading: https://repo.maven.apache.org/maven2/org/apache/sling/org.apache.sling.engine/2.2.0/org.apache.sling.engine-2.2.0.jar
[INFO] Downloading: https://repo.maven.apache.org/maven2/org/apache/sling/org.apache.sling.testing.tools/1.0.12/org.apache.sling.testing.tools-1.0.12.jar
[INFO] Downloaded: https://repo.maven.apache.org/maven2/org/apache/sling/org.apache.sling.junit.remote/1.0.8/org.apache.sling.junit.remote-1.0.8.jar
(25 KB at 289.7 KB/sec)
[INFO] Downloaded: https://repo.maven.apache.org/maven2/com/fasterxml/jackson/core/jackson-annotations/2.3.2/jackson-annotations-2.3.2.jar
(36 KB at 419.6 KB/sec)
[INFO] Downloading: https://repo.maven.apache.org/maven2/org/apache/httpcomponents/httpcore-nio/4.1.2/httpcore-nio-4.1.2.jar
[INFO] Downloading: https://repo.maven.apache.org/maven2/org/apache/httpcomponents/httpclient-cache/4.1.2/httpclient-cache-4.1.2.jar
[INFO] Downloaded: https://repo.maven.apache.org/maven2/org/apache/httpcomponents/httpclient-cache/4.1.2/httpclient-cache-4.1.2.jar
(104 KB at 738.0 KB/sec)
[INFO] Downloading: https://repo.maven.apache.org/maven2/org/apache/sling/org.apache.sling.launchpad/7/org.apache.sling.launchpad-7-standalone.jar
[INFO] Downloaded: https://repo.maven.apache.org/maven2/org/apache/httpcomponents/httpcore-nio/4.1.2/httpcore-nio-4.1.2.jar
(194 KB at 1230.7 KB/sec)
[INFO] Downloaded: https://repo.maven.apache.org/maven2/org/apache/sling/org.apache.sling.junit.core/1.0.8/org.apache.sling.junit.core-1.0.8.jar
(257 KB at 1179.8 KB/sec)
[INFO] Downloaded: https://repo.maven.apache.org/maven2/org/apache/sling/org.apache.sling.engine/2.2.0/org.apache.sling.engine-2.2.0.jar
(176 KB at 684.6 KB/sec)
[INFO] Downloaded: https://repo.maven.apache.org/maven2/org/apache/sling/org.apache.sling.testing.tools/1.0.12/org.apache.sling.testing.tools-1.0.12.jar
(78 KB at 297.5 KB/sec)
[INFO] Downloaded: https://repo.maven.apache.org/maven2/org/apache/sling/org.apache.sling.launchpad/7/org.apache.sling.launchpad-7-standalone.jar
(45750 KB at 16764.0 KB/sec)
[INFO] Downloading: http://repository.apache.org/snapshots/org/apache/sling/org.apache.sling.models.api/1.3.1-SNAPSHOT/org.apache.sling.models.api-1.3.1-20161030.234806-1.jar
[INFO] Downloading: http://repository.apache.org/snapshots/org/apache/sling/org.apache.sling.models.impl/1.3.1-SNAPSHOT/org.apache.sling.models.impl-1.3.1-20161101.000618-1.jar
[INFO] Downloading: http://repository.apache.org/snapshots/org/apache/sling/org.apache.sling.models.jacksonexporter/1.0.1-SNAPSHOT/org.apache.sling.models.jacksonexporter-1.0.1-SNAPSHOT.jar
[INFO] Downloaded: http://repository.apache.org/snapshots/org/apache/sling/org.apache.sling.models.api/1.3.1-SNAPSHOT/org.apache.sling.models.api-1.3.1-20161030.234806-1.jar
(41 KB at 89.1 KB/sec)
[INFO] Downloaded: http://repository.apache.org/snapshots/org/apache/sling/org.apache.sling.models.impl/1.3.1-SNAPSHOT/org.apache.sling.models.impl-1.3.1-20161101.000618-1.jar
(342 KB at 470.0 KB/sec)
[JENKINS] Archiving disabled
[JENKINS] Archiving disabled
[INFO] ------------------------------------------------------------------------
[INFO] BUILD FAILURE
[INFO] ------------------------------------------------------------------------
[INFO] Total time: 19.955 s
[INFO] Finished at: 2016-11-01T00:09:20+00:00
[INFO] Final Memory: 16M/251M
[INFO] ------------------------------------------------------------------------
Waiting for Jenkins to finish collecting data
[ERROR] Failed to execute goal on project org.apache.sling.models.integration-tests: Could
not resolve dependencies for project org.apache.sling:org.apache.sling.models.integration-tests:bundle:0.0.1-SNAPSHOT:
Could not find artifact org.apache.sling:org.apache.sling.models.jacksonexporter:jar:1.0.1-SNAPSHOT
in Nexus (http://repository.apache.org/snapshots) -> [Help 1]
[ERROR] 
[ERROR] To see the full stack trace of the errors, re-run Maven with the -e switch.
[ERROR] Re-run Maven using the -X switch to enable full debug logging.
[ERROR] 
[ERROR] For more information about the errors and possible solutions, please read the following
articles:
[ERROR] [Help 1] http://cwiki.apache.org/confluence/display/MAVEN/DependencyResolutionException
channel stopped
Recording test results

Mime
View raw message