sling-commits mailing list archives

Site index · List index
Message view « Date » · « Thread »
Top « Date » · « Thread »
From Apache Jenkins Server <jenk...@builds.apache.org>
Subject Build failed in Jenkins: sling-contrib-extensions-contextaware-config-spi-1.8 #11
Date Mon, 07 Nov 2016 09:38:49 GMT
See <https://builds.apache.org/job/sling-contrib-extensions-contextaware-config-spi-1.8/11/changes>

Changes:

[sseifert] SLING-6244 change method signature of CollectionInheritanceDecider to make it consistent
with ConfigurationResourceResolvingStrategy
add @NotNull annotations

------------------------------------------
Started by an SCM change
[EnvInject] - Loading node environment variables.
Building remotely on ubuntu-us1 (Ubuntu ubuntu docker) in workspace <https://builds.apache.org/job/sling-contrib-extensions-contextaware-config-spi-1.8/ws/>
Updating https://svn.apache.org/repos/asf/sling/trunk/contrib/extensions/contextaware-config/spi
at revision '2016-11-07T09:37:21.201 +0000'
U         src/main/java/org/apache/sling/caconfig/resource/spi/package-info.java
AU        src/main/java/org/apache/sling/caconfig/resource/spi/CollectionInheritanceDecider.java
AU        src/main/java/org/apache/sling/caconfig/resource/spi/InheritanceDecision.java
U         src/main/java/org/apache/sling/caconfig/resource/spi/ConfigurationResourceResolvingStrategy.java
At revision 1768465

Parsing POMs
Modules changed, recalculating dependency graph
Established TCP socket on 44777
maven32-agent.jar already up to date
maven32-interceptor.jar already up to date
maven3-interceptor-commons.jar already up to date
[sling-contrib-extensions-contextaware-config-spi-1.8] $ /home/jenkins/tools/java/latest1.8/bin/java
-Xmx2g -Xms256m -XX:MaxPermSize=512m -cp /home/jenkins/jenkins-slave/maven32-agent.jar:/home/jenkins/tools/maven/apache-maven-3.3.9/boot/plexus-classworlds-2.5.2.jar:/home/jenkins/tools/maven/apache-maven-3.3.9/conf/logging
jenkins.maven3.agent.Maven32Main /home/jenkins/tools/maven/apache-maven-3.3.9 /home/jenkins/jenkins-slave/slave.jar
/home/jenkins/jenkins-slave/maven32-interceptor.jar /home/jenkins/jenkins-slave/maven3-interceptor-commons.jar
44777
Java HotSpot(TM) 64-Bit Server VM warning: ignoring option MaxPermSize=512m; support was removed
in 8.0
<===[JENKINS REMOTING CAPACITY]===>   channel started
Executing Maven:  -B -f <https://builds.apache.org/job/sling-contrib-extensions-contextaware-config-spi-1.8/ws/pom.xml>
-Dmaven.repo.local=/home/jenkins/jenkins-slave/maven-repositories/1 -U clean verify
[INFO] Scanning for projects...
[INFO]                                                                         
[INFO] ------------------------------------------------------------------------
[INFO] Building Apache Sling Context-Aware Configuration SPI 1.0.1-SNAPSHOT
[INFO] ------------------------------------------------------------------------
[INFO] 
[INFO] --- maven-clean-plugin:3.0.0:clean (default-clean) @ org.apache.sling.caconfig.spi
---
[INFO] Deleting <https://builds.apache.org/job/sling-contrib-extensions-contextaware-config-spi-1.8/ws/target>
[INFO] 
[INFO] --- maven-enforcer-plugin:1.4.1:enforce (enforce-java) @ org.apache.sling.caconfig.spi
---
[INFO] 
[INFO] --- maven-antrun-plugin:1.8:run (set-bundle-required-execution-environment) @ org.apache.sling.caconfig.spi
---
[INFO] Executing tasks

main:
Setting Bundle-RequiredExecutionEnvironment=JavaSE-1.7 from sling.java.version=7
[INFO] Executed tasks
[INFO] 
[INFO] --- maven-remote-resources-plugin:1.5:process (process-resource-bundles) @ org.apache.sling.caconfig.spi
---
[INFO] 
[INFO] --- maven-remote-resources-plugin:1.5:process (default) @ org.apache.sling.caconfig.spi
---
[INFO] 
[INFO] --- maven-resources-plugin:2.7:resources (default-resources) @ org.apache.sling.caconfig.spi
---
[INFO] Using 'UTF-8' encoding to copy filtered resources.
[INFO] skip non existing resourceDirectory <https://builds.apache.org/job/sling-contrib-extensions-contextaware-config-spi-1.8/ws/src/main/resources>
[INFO] Copying 3 resources
[INFO] Copying 3 resources
[INFO] 
[INFO] --- maven-compiler-plugin:3.5.1:compile (default-compile) @ org.apache.sling.caconfig.spi
---
[INFO] Changes detected - recompiling the module!
[INFO] Compiling 14 source files to <https://builds.apache.org/job/sling-contrib-extensions-contextaware-config-spi-1.8/ws/target/classes>
[INFO] -------------------------------------------------------------
[ERROR] COMPILATION ERROR : 
[INFO] -------------------------------------------------------------
[ERROR] <https://builds.apache.org/job/sling-contrib-extensions-contextaware-config-spi-1.8/ws/src/main/java/org/apache/sling/caconfig/resource/spi/CollectionInheritanceDecider.java>:[24,31]
package com.sun.istack.internal does not exist
[ERROR] <https://builds.apache.org/job/sling-contrib-extensions-contextaware-config-spi-1.8/ws/src/main/java/org/apache/sling/caconfig/resource/spi/CollectionInheritanceDecider.java>:[44,42]
cannot find symbol
  symbol:   class NotNull
  location: interface org.apache.sling.caconfig.resource.spi.CollectionInheritanceDecider
[ERROR] <https://builds.apache.org/job/sling-contrib-extensions-contextaware-config-spi-1.8/ws/src/main/java/org/apache/sling/caconfig/resource/spi/CollectionInheritanceDecider.java>:[44,70]
cannot find symbol
  symbol:   class NotNull
  location: interface org.apache.sling.caconfig.resource.spi.CollectionInheritanceDecider
[ERROR] <https://builds.apache.org/job/sling-contrib-extensions-contextaware-config-spi-1.8/ws/src/main/java/org/apache/sling/caconfig/resource/spi/CollectionInheritanceDecider.java>:[44,6]
cannot find symbol
  symbol:   class NotNull
  location: interface org.apache.sling.caconfig.resource.spi.CollectionInheritanceDecider
[INFO] 4 errors 
[INFO] -------------------------------------------------------------
[JENKINS] Archiving disabled
[JENKINS] Archiving disabled
[INFO] ------------------------------------------------------------------------
[INFO] BUILD FAILURE
[INFO] ------------------------------------------------------------------------
[INFO] Total time: 15.055 s
[INFO] Finished at: 2016-11-07T09:38:43+00:00
[INFO] Final Memory: 30M/368M
[INFO] ------------------------------------------------------------------------
Waiting for Jenkins to finish collecting data
[ERROR] Failed to execute goal org.apache.maven.plugins:maven-compiler-plugin:3.5.1:compile
(default-compile) on project org.apache.sling.caconfig.spi: Compilation failure: Compilation
failure:
[ERROR] <https://builds.apache.org/job/sling-contrib-extensions-contextaware-config-spi-1.8/ws/src/main/java/org/apache/sling/caconfig/resource/spi/CollectionInheritanceDecider.java>:[24,31]
package com.sun.istack.internal does not exist
[ERROR] <https://builds.apache.org/job/sling-contrib-extensions-contextaware-config-spi-1.8/ws/src/main/java/org/apache/sling/caconfig/resource/spi/CollectionInheritanceDecider.java>:[44,42]
cannot find symbol
[ERROR] symbol:   class NotNull
[ERROR] location: interface org.apache.sling.caconfig.resource.spi.CollectionInheritanceDecider
[ERROR] <https://builds.apache.org/job/sling-contrib-extensions-contextaware-config-spi-1.8/ws/src/main/java/org/apache/sling/caconfig/resource/spi/CollectionInheritanceDecider.java>:[44,70]
cannot find symbol
[ERROR] symbol:   class NotNull
[ERROR] location: interface org.apache.sling.caconfig.resource.spi.CollectionInheritanceDecider
[ERROR] <https://builds.apache.org/job/sling-contrib-extensions-contextaware-config-spi-1.8/ws/src/main/java/org/apache/sling/caconfig/resource/spi/CollectionInheritanceDecider.java>:[44,6]
cannot find symbol
[ERROR] symbol:   class NotNull
[ERROR] location: interface org.apache.sling.caconfig.resource.spi.CollectionInheritanceDecider
[ERROR] -> [Help 1]
[ERROR] 
[ERROR] To see the full stack trace of the errors, re-run Maven with the -e switch.
[ERROR] Re-run Maven using the -X switch to enable full debug logging.
[ERROR] 
[ERROR] For more information about the errors and possible solutions, please read the following
articles:
[ERROR] [Help 1] http://cwiki.apache.org/confluence/display/MAVEN/MojoFailureException
channel stopped
Recording test results

Mime
View raw message