sling-commits mailing list archives

Site index · List index
Message view « Date » · « Thread »
Top « Date » · « Thread »
From Apache Jenkins Server <jenk...@builds.apache.org>
Subject Build failed in Jenkins: sling-contrib-explorers-resourceeditor-1.7 #3
Date Sat, 05 Nov 2016 23:39:03 GMT
See <https://builds.apache.org/job/sling-contrib-explorers-resourceeditor-1.7/3/changes>

Changes:

[sboehme] SLING-6248 Resource Editor :: Create a simple Resource Type Editor

------------------------------------------
[...truncated 1966 lines...]
[ERROR] npm http GET https://registry.npmjs.org/json-stringify-safe
[ERROR] npm http GET https://registry.npmjs.org/node-uuid
[ERROR] npm http GET https://registry.npmjs.org/oauth-sign
[ERROR] npm http GET https://registry.npmjs.org/stringstream
[ERROR] npm http GET https://registry.npmjs.org/tough-cookie
[ERROR] npm http GET https://registry.npmjs.org/tunnel-agent
[ERROR] npm http GET https://registry.npmjs.org/aws-sign2
[ERROR] npm http 304 https://registry.npmjs.org/caseless
[ERROR] npm http GET https://registry.npmjs.org/aws4
[ERROR] npm http 200 https://registry.npmjs.org/is-arrayish
[ERROR] npm http 304 https://registry.npmjs.org/extend
[ERROR] npm http 304 https://registry.npmjs.org/har-validator
[ERROR] npm http 304 https://registry.npmjs.org/forever-agent
[ERROR] npm http 304 https://registry.npmjs.org/hawk
[ERROR] npm http 304 https://registry.npmjs.org/form-data
[ERROR] npm http 304 https://registry.npmjs.org/is-typedarray
[ERROR] npm http 304 https://registry.npmjs.org/isstream
[ERROR] npm http 304 https://registry.npmjs.org/json-stringify-safe
[ERROR] npm http 304 https://registry.npmjs.org/tough-cookie
[ERROR] npm http 304 https://registry.npmjs.org/stringstream
[ERROR] npm http 304 https://registry.npmjs.org/node-uuid
[ERROR] npm http 304 https://registry.npmjs.org/oauth-sign
[ERROR] npm http 304 https://registry.npmjs.org/tunnel-agent
[ERROR] npm http 304 https://registry.npmjs.org/http-signature
[ERROR] npm http 304 https://registry.npmjs.org/aws-sign2
[ERROR] npm http GET https://registry.npmjs.org/block-stream
[ERROR] npm http GET https://registry.npmjs.org/spdx-license-ids
[ERROR] npm http 304 https://registry.npmjs.org/aws4
[ERROR] npm http 304 https://registry.npmjs.org/combined-stream
[ERROR] npm http 200 https://registry.npmjs.org/block-stream
[ERROR] npm http 200 https://registry.npmjs.org/spdx-license-ids
[ERROR] npm http GET https://registry.npmjs.org/delayed-stream
[ERROR] npm http 304 https://registry.npmjs.org/delayed-stream
[ERROR] npm http GET https://registry.npmjs.org/string_decoder
[ERROR] npm http GET https://registry.npmjs.org/core-util-is
[ERROR] npm http GET https://registry.npmjs.org/asynckit
[ERROR] npm http 304 https://registry.npmjs.org/core-util-is
[ERROR] npm http 304 https://registry.npmjs.org/asynckit
[ERROR] npm http 304 https://registry.npmjs.org/string_decoder
[ERROR] npm http GET https://registry.npmjs.org/assert-plus
[ERROR] npm http GET https://registry.npmjs.org/jsprim
[ERROR] npm http GET https://registry.npmjs.org/sshpk
[ERROR] npm http 304 https://registry.npmjs.org/assert-plus
[ERROR] npm http 304 https://registry.npmjs.org/sshpk
[ERROR] npm http 304 https://registry.npmjs.org/jsprim
[ERROR] npm http GET https://registry.npmjs.org/chalk
[ERROR] npm http GET https://registry.npmjs.org/commander
[ERROR] npm http GET https://registry.npmjs.org/is-my-json-valid
[ERROR] npm http 304 https://registry.npmjs.org/commander
[ERROR] npm http 304 https://registry.npmjs.org/chalk
[ERROR] npm http 304 https://registry.npmjs.org/is-my-json-valid
[ERROR] npm http 304 https://registry.npmjs.org/setprototypeof
[ERROR] npm http GET https://registry.npmjs.org/supports-color
[ERROR] npm http GET https://registry.npmjs.org/ansi-styles
[ERROR] npm http GET https://registry.npmjs.org/escape-string-regexp
[ERROR] npm http GET https://registry.npmjs.org/has-ansi
[ERROR] npm http GET https://registry.npmjs.org/verror
[ERROR] npm http GET https://registry.npmjs.org/extsprintf
[ERROR] npm http GET https://registry.npmjs.org/json-schema
[ERROR] npm http 304 https://registry.npmjs.org/supports-color
[ERROR] npm http 304 https://registry.npmjs.org/has-ansi
[ERROR] npm http 304 https://registry.npmjs.org/escape-string-regexp
[ERROR] npm http 304 https://registry.npmjs.org/ansi-styles
[ERROR] npm http 304 https://registry.npmjs.org/extsprintf
[ERROR] npm http 304 https://registry.npmjs.org/verror
[ERROR] npm http 304 https://registry.npmjs.org/json-schema
[ERROR] npm http GET https://registry.npmjs.org/graceful-readlink
[ERROR] npm http 304 https://registry.npmjs.org/graceful-readlink
[INFO] 
[INFO] > bufferutil@1.1.0 install <https://builds.apache.org/job/sling-contrib-explorers-resourceeditor-1.7/ws/frontend/node_modules/grunt-node-inspector/node_modules/node-inspector/node_modules/ws/node_modules/bufferutil>
[INFO] > node-gyp rebuild
[INFO] 
[ERROR] child_process: customFds option is deprecated, use stdio instead.
[ERROR] Usage: gyp_main.py [options ...] [build_file ...]
[ERROR] 
[ERROR] gyp_main.py: error: no such option: --no-parallel
[ERROR] gyp ERR! configure error 
[ERROR] gyp ERR! stack Error: `gyp` failed with exit code: 2
[ERROR] gyp ERR! stack     at ChildProcess.onCpExit (<https://builds.apache.org/job/sling-contrib-explorers-resourceeditor-1.7/ws/node/npm/node_modules/node-gyp/lib/configure.js>:340:16)
[ERROR] gyp ERR! stack     at ChildProcess.emit (events.js:110:17)
[ERROR] gyp ERR! stack     at Process.ChildProcess._handle.onexit (child_process.js:1067:12)
[ERROR] gyp ERR! System Linux 3.19.0-25-generic
[ERROR] gyp ERR! command "node" "<https://builds.apache.org/job/sling-contrib-explorers-resourceeditor-1.7/ws/node/npm/node_modules/node-gyp/bin/node-gyp.js">
"rebuild"
[ERROR] gyp ERR! cwd <https://builds.apache.org/job/sling-contrib-explorers-resourceeditor-1.7/ws/frontend/node_modules/grunt-node-inspector/node_modules/node-inspector/node_modules/ws/node_modules/bufferutil>
[ERROR] gyp ERR! node -v v0.12.1
[ERROR] gyp ERR! node-gyp -v v0.13.0
[ERROR] gyp ERR! not ok 
[ERROR] npm WARN optional dep failed, continuing utf-8-validate@1.1.0
[ERROR] npm http GET https://registry.npmjs.org/punycode
[ERROR] npm http GET https://registry.npmjs.org/buffer-shims
[ERROR] npm http GET https://registry.npmjs.org/isarray
[ERROR] npm http GET https://registry.npmjs.org/process-nextick-args
[ERROR] npm http GET https://registry.npmjs.org/util-deprecate
[ERROR] npm http 304 https://registry.npmjs.org/punycode
[ERROR] npm http 304 https://registry.npmjs.org/buffer-shims
[ERROR] npm http 304 https://registry.npmjs.org/util-deprecate
[ERROR] npm http 304 https://registry.npmjs.org/isarray
[ERROR] npm http 304 https://registry.npmjs.org/process-nextick-args
[ERROR] npm WARN optional dep failed, continuing bufferutil@1.1.0
[ERROR] npm http GET https://registry.npmjs.org/xmldom
[ERROR] npm http GET https://registry.npmjs.org/xmlbuilder
[ERROR] npm http GET https://registry.npmjs.org/base64-js
[ERROR] npm http 200 https://registry.npmjs.org/base64-js
[ERROR] npm http GET https://registry.npmjs.org/base64-js/-/base64-js-0.0.8.tgz
[ERROR] npm http 200 https://registry.npmjs.org/xmldom
[ERROR] npm http 200 https://registry.npmjs.org/xmlbuilder
[ERROR] npm http GET https://registry.npmjs.org/generate-function
[ERROR] npm http GET https://registry.npmjs.org/generate-object-property
[ERROR] npm http GET https://registry.npmjs.org/jsonpointer
[ERROR] npm http GET https://registry.npmjs.org/xmlbuilder/-/xmlbuilder-4.0.0.tgz
[ERROR] npm http GET https://registry.npmjs.org/xmldom/-/xmldom-0.1.22.tgz
[ERROR] npm http 200 https://registry.npmjs.org/base64-js/-/base64-js-0.0.8.tgz
[ERROR] npm http 304 https://registry.npmjs.org/jsonpointer
[ERROR] npm http 304 https://registry.npmjs.org/generate-function
[ERROR] npm http 304 https://registry.npmjs.org/generate-object-property
[ERROR] npm http 200 https://registry.npmjs.org/xmlbuilder/-/xmlbuilder-4.0.0.tgz
[ERROR] npm http 200 https://registry.npmjs.org/xmldom/-/xmldom-0.1.22.tgz
[ERROR] npm http GET https://registry.npmjs.org/dashdash
[ERROR] npm http GET https://registry.npmjs.org/getpass
[ERROR] npm http GET https://registry.npmjs.org/jsbn
[ERROR] npm http GET https://registry.npmjs.org/tweetnacl
[ERROR] npm http GET https://registry.npmjs.org/jodid25519
[ERROR] npm http GET https://registry.npmjs.org/ecc-jsbn
[ERROR] npm http GET https://registry.npmjs.org/bcrypt-pbkdf
[ERROR] npm http GET https://registry.npmjs.org/asn1
[ERROR] npm http 304 https://registry.npmjs.org/jsbn
[ERROR] npm http 304 https://registry.npmjs.org/dashdash
[ERROR] npm http 304 https://registry.npmjs.org/tweetnacl
[ERROR] npm http 200 https://registry.npmjs.org/jodid25519
[ERROR] npm http 304 https://registry.npmjs.org/getpass
[ERROR] npm http 304 https://registry.npmjs.org/asn1
[ERROR] npm http 304 https://registry.npmjs.org/bcrypt-pbkdf
[ERROR] npm http 304 https://registry.npmjs.org/ecc-jsbn
[ERROR] npm http GET https://registry.npmjs.org/sntp
[ERROR] npm http GET https://registry.npmjs.org/cryptiles
[ERROR] npm http GET https://registry.npmjs.org/hoek
[ERROR] npm http GET https://registry.npmjs.org/boom
[ERROR] npm http 304 https://registry.npmjs.org/sntp
[ERROR] npm http 304 https://registry.npmjs.org/boom
[ERROR] npm http 304 https://registry.npmjs.org/cryptiles
[ERROR] npm http 304 https://registry.npmjs.org/hoek
[ERROR] npm http GET https://registry.npmjs.org/is-property
[ERROR] npm http 304 https://registry.npmjs.org/is-property
[INFO] 
[INFO] > v8-debug@0.4.6 install <https://builds.apache.org/job/sling-contrib-explorers-resourceeditor-1.7/ws/frontend/node_modules/grunt-node-inspector/node_modules/node-inspector/node_modules/v8-debug>
[INFO] > node-pre-gyp install --fallback-to-build
[INFO] 
[ERROR] node-pre-gyp http GET https://node-inspector.s3.amazonaws.com/debug/v0.4.6/node-v14-linux-x64.tar.gz
[ERROR] node-pre-gyp http 404 https://node-inspector.s3.amazonaws.com/debug/v0.4.6/node-v14-linux-x64.tar.gz
[ERROR] node-pre-gyp ERR! Tried to download(404): https://node-inspector.s3.amazonaws.com/debug/v0.4.6/node-v14-linux-x64.tar.gz

[ERROR] node-pre-gyp ERR! Pre-built binaries not found for v8-debug@0.4.6 and node@0.12.1
(node-v14 ABI) (falling back to source compile with node-gyp) 
[ERROR] node-pre-gyp http 404 status code downloading tarball https://node-inspector.s3.amazonaws.com/debug/v0.4.6/node-v14-linux-x64.tar.gz

[ERROR] child_process: customFds option is deprecated, use stdio instead.
[ERROR] Usage: gyp_main.py [options ...] [build_file ...]
[ERROR] 
[ERROR] gyp_main.py: error: no such option: --no-parallel
[ERROR] gyp ERR! configure error 
[ERROR] gyp ERR! stack Error: `gyp` failed with exit code: 2
[ERROR] gyp ERR! stack     at ChildProcess.onCpExit (<https://builds.apache.org/job/sling-contrib-explorers-resourceeditor-1.7/ws/node/npm/node_modules/node-gyp/lib/configure.js>:340:16)
[ERROR] gyp ERR! stack     at ChildProcess.emit (events.js:110:17)
[ERROR] gyp ERR! stack     at Process.ChildProcess._handle.onexit (child_process.js:1067:12)
[ERROR] gyp ERR! System Linux 3.19.0-25-generic
[ERROR] gyp ERR! command "node" "<https://builds.apache.org/job/sling-contrib-explorers-resourceeditor-1.7/ws/node/npm/node_modules/node-gyp/bin/node-gyp.js">
"configure" "--fallback-to-build" "--module=<https://builds.apache.org/job/sling-contrib-explorers-resourceeditor-1.7/ws/frontend/node_modules/grunt-node-inspector/node_modules/node-inspector/node_modules/v8-debug/build/debug/v0.4.6/node-v14-linux-x64/debug.node">
"--module_name=debug" "--module_path=<https://builds.apache.org/job/sling-contrib-explorers-resourceeditor-1.7/ws/frontend/node_modules/grunt-node-inspector/node_modules/node-inspector/node_modules/v8-debug/build/debug/v0.4.6/node-v14-linux-x64">
[ERROR] gyp ERR! cwd <https://builds.apache.org/job/sling-contrib-explorers-resourceeditor-1.7/ws/frontend/node_modules/grunt-node-inspector/node_modules/node-inspector/node_modules/v8-debug>
[ERROR] gyp ERR! node -v v0.12.1
[ERROR] gyp ERR! node-gyp -v v0.13.0
[ERROR] gyp ERR! not ok 
[ERROR] node-pre-gyp ERR! build error 
[ERROR] node-pre-gyp ERR! stack Error: Failed to execute 'node-gyp configure --fallback-to-build
--module=<https://builds.apache.org/job/sling-contrib-explorers-resourceeditor-1.7/ws/frontend/node_modules/grunt-node-inspector/node_modules/node-inspector/node_modules/v8-debug/build/debug/v0.4.6/node-v14-linux-x64/debug.node>
--module_name=debug --module_path=<https://builds.apache.org/job/sling-contrib-explorers-resourceeditor-1.7/ws/frontend/node_modules/grunt-node-inspector/node_modules/node-inspector/node_modules/v8-debug/build/debug/v0.4.6/node-v14-linux-x64'>
(1)
[ERROR] node-pre-gyp ERR! stack     at ChildProcess.<anonymous> (<https://builds.apache.org/job/sling-contrib-explorers-resourceeditor-1.7/ws/frontend/node_modules/grunt-node-inspector/node_modules/node-inspector/node_modules/v8-debug/node_modules/node-pre-gyp/lib/util/compile.js>:83:29)
[ERROR] node-pre-gyp ERR! stack     at ChildProcess.emit (events.js:110:17)
[ERROR] node-pre-gyp ERR! stack     at maybeClose (child_process.js:1008:16)
[ERROR] node-pre-gyp ERR! stack     at Process.ChildProcess._handle.onexit (child_process.js:1080:5)
[ERROR] node-pre-gyp ERR! System Linux 3.19.0-25-generic
[ERROR] node-pre-gyp ERR! command "node" "<https://builds.apache.org/job/sling-contrib-explorers-resourceeditor-1.7/ws/frontend/node_modules/grunt-node-inspector/node_modules/node-inspector/node_modules/v8-debug/node_modules/.bin/node-pre-gyp">
"install" "--fallback-to-build"
[ERROR] node-pre-gyp ERR! cwd <https://builds.apache.org/job/sling-contrib-explorers-resourceeditor-1.7/ws/frontend/node_modules/grunt-node-inspector/node_modules/node-inspector/node_modules/v8-debug>
[ERROR] node-pre-gyp ERR! node -v v0.12.1
[ERROR] node-pre-gyp ERR! node-pre-gyp -v v0.6.31
[ERROR] node-pre-gyp ERR! not ok 
[INFO] Failed to execute 'node-gyp configure --fallback-to-build --module=<https://builds.apache.org/job/sling-contrib-explorers-resourceeditor-1.7/ws/frontend/node_modules/grunt-node-inspector/node_modules/node-inspector/node_modules/v8-debug/build/debug/v0.4.6/node-v14-linux-x64/debug.node>
--module_name=debug --module_path=<https://builds.apache.org/job/sling-contrib-explorers-resourceeditor-1.7/ws/frontend/node_modules/grunt-node-inspector/node_modules/node-inspector/node_modules/v8-debug/build/debug/v0.4.6/node-v14-linux-x64'>
(1)
[ERROR] npm http GET https://registry.npmjs.org/split
[INFO] 
[INFO] > v8-profiler@5.2.12 install <https://builds.apache.org/job/sling-contrib-explorers-resourceeditor-1.7/ws/frontend/node_modules/grunt-node-inspector/node_modules/node-inspector/node_modules/v8-profiler>
[INFO] > node-pre-gyp install --fallback-to-build
[INFO] 
[ERROR] module.js:338
[ERROR]     throw err;
[ERROR]           ^
[ERROR] Error: Cannot find module '<https://builds.apache.org/job/sling-contrib-explorers-resourceeditor-1.7/ws/frontend/node_modules/grunt-node-inspector/node_modules/node-inspector/node_modules/v8-profiler/node_modules/.bin/node-pre-gyp'>
[ERROR]     at Function.Module._resolveFilename (module.js:336:15)
[ERROR]     at Function.Module._load (module.js:278:25)
[ERROR]     at Function.Module.runMain (module.js:501:10)
[ERROR]     at startup (node.js:129:16)
[ERROR]     at node.js:814:3
[ERROR] npm ERR! v8-debug@0.4.6 install: `node-pre-gyp install --fallback-to-build`
[ERROR] npm ERR! Exit status 1
[ERROR] npm ERR! 
[ERROR] npm ERR! Failed at the v8-debug@0.4.6 install script.
[ERROR] npm ERR! This is most likely a problem with the v8-debug package,
[ERROR] npm ERR! not with npm itself.
[ERROR] npm ERR! Tell the author that this fails on your system:
[ERROR] npm ERR!     node-pre-gyp install --fallback-to-build
[ERROR] npm ERR! You can get their info via:
[ERROR] npm ERR!     npm owner ls v8-debug
[ERROR] npm ERR! There is likely additional logging output above.
[ERROR] 
[ERROR] npm ERR! System Linux 3.19.0-25-generic
[ERROR] npm ERR! command "<https://builds.apache.org/job/sling-contrib-explorers-resourceeditor-1.7/ws/node/node">
"<https://builds.apache.org/job/sling-contrib-explorers-resourceeditor-1.7/ws/node/npm/bin/npm-cli.js">
"install" "--color=false"
[ERROR] npm ERR! cwd <https://builds.apache.org/job/sling-contrib-explorers-resourceeditor-1.7/ws/frontend>
[ERROR] npm ERR! node -v v0.12.1
[ERROR] npm ERR! npm -v 1.4.9
[ERROR] npm ERR! code ELIFECYCLE
[ERROR] npm http 200 https://registry.npmjs.org/split
[ERROR] npm WARN engine request@2.78.0: wanted: {"node":">= 4"} (current: {"node":"v0.12.1","npm":"1.4.9"})
[ERROR] npm http GET https://registry.npmjs.org/strip-ansi
[ERROR] npm http GET https://registry.npmjs.org/through
[ERROR] npm http 304 https://registry.npmjs.org/strip-ansi
[ERROR] npm http GET https://registry.npmjs.org/mime-types
[ERROR] npm http GET https://registry.npmjs.org/qs
[ERROR] npm http 304 https://registry.npmjs.org/through
[ERROR] npm http 304 https://registry.npmjs.org/qs
[ERROR] npm http 304 https://registry.npmjs.org/mime-types
[ERROR] npm http GET https://registry.npmjs.org/ansi-regex
[ERROR] npm http 304 https://registry.npmjs.org/ansi-regex
[ERROR] npm http GET https://registry.npmjs.org/mime-db
[ERROR] npm http 304 https://registry.npmjs.org/mime-db
[ERROR] npm ERR! 
[ERROR] npm ERR! Additional logging details can be found in:
[ERROR] npm ERR!     <https://builds.apache.org/job/sling-contrib-explorers-resourceeditor-1.7/ws/frontend/npm-debug.log>
[ERROR] npm ERR! not ok code 0
[JENKINS] Archiving disabled
[JENKINS] Archiving disabled
[INFO] ------------------------------------------------------------------------
[INFO] BUILD FAILURE
[INFO] ------------------------------------------------------------------------
[INFO] Total time: 01:11 min
[INFO] Finished at: 2016-11-05T23:39:16+00:00
[INFO] Final Memory: 29M/451M
[INFO] ------------------------------------------------------------------------
Waiting for Jenkins to finish collecting data
[ERROR] Failed to execute goal com.github.eirslett:frontend-maven-plugin:0.0.24:npm (npm install)
on project org.apache.sling.resource-editor: Failed to run task: 'npm install --color=false'
failed. (error code 1) -> [Help 1]
[ERROR] 
[ERROR] To see the full stack trace of the errors, re-run Maven with the -e switch.
[ERROR] Re-run Maven using the -X switch to enable full debug logging.
[ERROR] 
[ERROR] For more information about the errors and possible solutions, please read the following
articles:
[ERROR] [Help 1] http://cwiki.apache.org/confluence/display/MAVEN/MojoFailureException
channel stopped
Recording test results

Mime
View raw message