sling-commits mailing list archives

Site index · List index
Message view « Date » · « Thread »
Top « Date » · « Thread »
From Apache Jenkins Server <jenk...@builds.apache.org>
Subject Build failed in Jenkins: sling-contrib-extensions-contextaware-config-spi-1.7 #14
Date Mon, 07 Nov 2016 10:21:09 GMT
See <https://builds.apache.org/job/sling-contrib-extensions-contextaware-config-spi-1.7/14/changes>

Changes:

[cziegeler] [maven-release-plugin] prepare release org.apache.sling.caconfig.spi-1.1.0

------------------------------------------
[...truncated 21 lines...]
[INFO] ------------------------------------------------------------------------
[INFO] Building Apache Sling Context-Aware Configuration SPI 1.1.0
[INFO] ------------------------------------------------------------------------
[INFO] 
[INFO] --- maven-clean-plugin:3.0.0:clean (default-clean) @ org.apache.sling.caconfig.spi
---
[INFO] Deleting <https://builds.apache.org/job/sling-contrib-extensions-contextaware-config-spi-1.7/ws/target>
[INFO] 
[INFO] --- maven-enforcer-plugin:1.4.1:enforce (enforce-java) @ org.apache.sling.caconfig.spi
---
[INFO] 
[INFO] --- maven-antrun-plugin:1.8:run (set-bundle-required-execution-environment) @ org.apache.sling.caconfig.spi
---
[INFO] Executing tasks

main:
Setting Bundle-RequiredExecutionEnvironment=JavaSE-1.7 from sling.java.version=7
[INFO] Executed tasks
[INFO] 
[INFO] --- maven-remote-resources-plugin:1.5:process (process-resource-bundles) @ org.apache.sling.caconfig.spi
---
[INFO] 
[INFO] --- maven-remote-resources-plugin:1.5:process (default) @ org.apache.sling.caconfig.spi
---
[INFO] 
[INFO] --- maven-resources-plugin:2.7:resources (default-resources) @ org.apache.sling.caconfig.spi
---
[INFO] Using 'UTF-8' encoding to copy filtered resources.
[INFO] skip non existing resourceDirectory <https://builds.apache.org/job/sling-contrib-extensions-contextaware-config-spi-1.7/ws/src/main/resources>
[INFO] Copying 3 resources
[INFO] Copying 3 resources
[INFO] 
[INFO] --- maven-compiler-plugin:3.5.1:compile (default-compile) @ org.apache.sling.caconfig.spi
---
[INFO] Changes detected - recompiling the module!
[INFO] Compiling 14 source files to <https://builds.apache.org/job/sling-contrib-extensions-contextaware-config-spi-1.7/ws/target/classes>
[INFO] 
[INFO] --- maven-resources-plugin:2.7:testResources (default-testResources) @ org.apache.sling.caconfig.spi
---
[INFO] Using 'UTF-8' encoding to copy filtered resources.
[INFO] skip non existing resourceDirectory <https://builds.apache.org/job/sling-contrib-extensions-contextaware-config-spi-1.7/ws/src/test/resources>
[INFO] Copying 3 resources
[INFO] Copying 3 resources
[INFO] 
[INFO] --- maven-compiler-plugin:3.5.1:testCompile (default-testCompile) @ org.apache.sling.caconfig.spi
---
[INFO] Changes detected - recompiling the module!
[INFO] Compiling 3 source files to <https://builds.apache.org/job/sling-contrib-extensions-contextaware-config-spi-1.7/ws/target/test-classes>
[INFO] 
[INFO] --- maven-surefire-plugin:2.18.1:test (default-test) @ org.apache.sling.caconfig.spi
---
[INFO] Surefire report directory: <https://builds.apache.org/job/sling-contrib-extensions-contextaware-config-spi-1.7/ws/target/surefire-reports>

-------------------------------------------------------
 T E S T S
-------------------------------------------------------
Running org.apache.sling.caconfig.resource.spi.ContextResourceTest
Tests run: 3, Failures: 0, Errors: 0, Skipped: 0, Time elapsed: 1.052 sec - in org.apache.sling.caconfig.resource.spi.ContextResourceTest
Running org.apache.sling.caconfig.spi.metadata.PropertyMetadataTest
Tests run: 6, Failures: 0, Errors: 0, Skipped: 0, Time elapsed: 0 sec - in org.apache.sling.caconfig.spi.metadata.PropertyMetadataTest
Running org.apache.sling.caconfig.spi.metadata.ConfigurationMetadataTest
Tests run: 1, Failures: 0, Errors: 0, Skipped: 0, Time elapsed: 0 sec - in org.apache.sling.caconfig.spi.metadata.ConfigurationMetadataTest

Results :

Tests run: 10, Failures: 0, Errors: 0, Skipped: 0

[JENKINS] Recording test results
[INFO] 
[INFO] --- animal-sniffer-maven-plugin:1.15:check (default) @ org.apache.sling.caconfig.spi
---
[INFO] Checking unresolved references to org.codehaus.mojo.signature:java17:1.0
[INFO] 
[INFO] --- maven-bundle-plugin:3.2.0:bundle (default-bundle) @ org.apache.sling.caconfig.spi
---
[INFO] 
[INFO] >>> maven-source-plugin:3.0.1:jar (attach-sources) > generate-sources @
org.apache.sling.caconfig.spi >>>
[INFO] 
[INFO] --- maven-enforcer-plugin:1.4.1:enforce (enforce-java) @ org.apache.sling.caconfig.spi
---
[INFO] 
[INFO] --- maven-antrun-plugin:1.8:run (set-bundle-required-execution-environment) @ org.apache.sling.caconfig.spi
---
[INFO] Executing tasks

main:
Setting Bundle-RequiredExecutionEnvironment=JavaSE-1.7 from sling.java.version=7
[INFO] Executed tasks
[WARNING] Failed to getClass for org.apache.maven.plugins.source.SourceJarMojo
[INFO] 
[INFO] <<< maven-source-plugin:3.0.1:jar (attach-sources) < generate-sources @
org.apache.sling.caconfig.spi <<<
[INFO] 
[INFO] --- maven-source-plugin:3.0.1:jar (attach-sources) @ org.apache.sling.caconfig.spi
---
[INFO] Building jar: <https://builds.apache.org/job/sling-contrib-extensions-contextaware-config-spi-1.7/ws/target/org.apache.sling.caconfig.spi-1.1.0-sources.jar>
[INFO] 
[INFO] --- maven-site-plugin:3.5.1:attach-descriptor (attach-descriptor) @ org.apache.sling.caconfig.spi
---
[INFO] 
[INFO] --- ianal-maven-plugin:1.0-alpha-1:verify-legal-files (default) @ org.apache.sling.caconfig.spi
---
[INFO] Checking legal files in: org.apache.sling.caconfig.spi-1.1.0.jar
[INFO] Checking legal files in: org.apache.sling.caconfig.spi-1.1.0-sources.jar
[INFO] 
[INFO] --- apache-rat-plugin:0.11:check (default) @ org.apache.sling.caconfig.spi ---
[INFO] 51 implicit excludes (use -debug for more details).
[INFO] Exclude: DEPENDENCIES
[INFO] Exclude: src/main/appended-resources/META-INF/*
[INFO] Exclude: velocity.log
[INFO] Exclude: target/*
[INFO] Exclude: README.md
[INFO] Exclude: maven-eclipse.xml
[INFO] Exclude: .*
[INFO] Exclude: .*/**
[INFO] Exclude: **/*.json
[INFO] Exclude: DEPENDENCIES
[INFO] Exclude: **/*.rej
[INFO] Exclude: hs_err_*.log
[INFO] 19 resources included (use -debug for more details)
[INFO] Rat check: Summary of files. Unapproved: 0 unknown: 0 generated: 0 approved: 18 licence.
[INFO] 
[INFO] --- maven-bundle-plugin:3.2.0:baseline (baseline) @ org.apache.sling.caconfig.spi ---
[INFO] artifact org.apache.sling:org.apache.sling.caconfig.spi: checking for updates from
central
[INFO] Baseline Report - Generated by Apache Felix Maven Bundle Plugin on 2016-11-07T10:19Z
based on Bnd - see http://www.aqute.biz/Bnd/Bnd
[INFO] Comparing bundle org.apache.sling.caconfig.spi version 1.1.0 to version 1.0.0
[INFO] 
[INFO]   PACKAGE_NAME                                       DELTA      CUR_VER    BASE_VER
  REC_VER    WARNINGS  
[INFO] = ================================================== ========== ========== ==========
========== ==========
[INFO] < org.apache.sling.caconfig.resource.spi             minor      1.1.0      1.0.0
     1.1.0      -         
[INFO]      + interface org.apache.sling.caconfig.resource.spi.CollectionInheritanceDecider
[INFO]          + access abstract
[INFO]          + method decide(org.apache.sling.api.resource.Resource,java.lang.String)
[INFO]              + access abstract
[INFO]              + annotated javax.annotation.CheckForNull
[INFO]              + annotated javax.annotation.Nonnull
[INFO]              + annotated javax.annotation.Nonnull
[INFO]              + return org.apache.sling.caconfig.resource.spi.InheritanceDecision
[INFO]          + annotated org.osgi.annotation.versioning.ConsumerType
[INFO]      + enum org.apache.sling.caconfig.resource.spi.InheritanceDecision
[INFO]          + access final
[INFO]          + extends java.lang.Enum
[INFO]          + implements java.io.Serializable
[INFO]          + implements java.lang.Comparable
[INFO]          + field org.apache.sling.caconfig.resource.spi.InheritanceDecision BLOCK
[INFO]              + access final
[INFO]              + access static
[INFO]          + field org.apache.sling.caconfig.resource.spi.InheritanceDecision EXCLUDE
[INFO]              + access final
[INFO]              + access static
[INFO]          + field org.apache.sling.caconfig.resource.spi.InheritanceDecision INCLUDE
[INFO]              + access final
[INFO]              + access static
[INFO]          + method clone()
[INFO]              + access final
[INFO]              + access protected
[INFO]          + method compareTo(TE;)
[INFO]              + access final
[INFO]              + return int
[INFO]          + method compareTo(TT;)
[INFO]              + access abstract
[INFO]              + return int
[INFO]          + method equals(java.lang.Object)
[INFO]              + access final
[INFO]              + return boolean
[INFO]          + method finalize()
[INFO]              + access final
[INFO]              + access protected
[INFO]          + method getDeclaringClass()
[INFO]              + access final
[INFO]              + return java.lang.Class<TE;>
[INFO]          + method hashCode()
[INFO]              + access final
[INFO]              + return int
[INFO]          + method name()
[INFO]              + access final
[INFO]              + return java.lang.String
[INFO]          + method ordinal()
[INFO]              + access final
[INFO]              + return int
[INFO]          + method toString()
[INFO]              + return java.lang.String
[INFO]          + method valueOf(Ljava/lang/Class<TT;>;Ljava/lang/String;)
[INFO]              + access static
[INFO]              + return T
[INFO]          + method valueOf(java.lang.String)
[INFO]              + access static
[INFO]              + return org.apache.sling.caconfig.resource.spi.InheritanceDecision
[INFO]          + method values()
[INFO]              + access static
[INFO]              + return org.apache.sling.caconfig.resource.spi.InheritanceDecision[]
[INFO]      - version 1.0.0
[INFO]      + version 1.1.0
[INFO] -----------------------------------------------------------------------------------------------------------
[INFO]   org.apache.sling.caconfig.spi                      unchanged  1.0.0      1.0.0  
   1.0.0      -         
[INFO] -----------------------------------------------------------------------------------------------------------
[INFO]   org.apache.sling.caconfig.spi.metadata             unchanged  1.0.0      1.0.0  
   1.0.0      -         
[INFO] -----------------------------------------------------------------------------------------------------------
[INFO] Baseline analysis complete, 0 error(s), 0 warning(s)
[INFO] 
[INFO] --- maven-install-plugin:2.5.2:install (default-install) @ org.apache.sling.caconfig.spi
---
[INFO] Installing <https://builds.apache.org/job/sling-contrib-extensions-contextaware-config-spi-1.7/ws/target/org.apache.sling.caconfig.spi-1.1.0.jar>
to /home/jenkins/jenkins-slave/maven-repositories/0/org/apache/sling/org.apache.sling.caconfig.spi/1.1.0/org.apache.sling.caconfig.spi-1.1.0.jar
[INFO] Installing <https://builds.apache.org/job/sling-contrib-extensions-contextaware-config-spi-1.7/ws/pom.xml>
to /home/jenkins/jenkins-slave/maven-repositories/0/org/apache/sling/org.apache.sling.caconfig.spi/1.1.0/org.apache.sling.caconfig.spi-1.1.0.pom
[INFO] Installing <https://builds.apache.org/job/sling-contrib-extensions-contextaware-config-spi-1.7/ws/target/org.apache.sling.caconfig.spi-1.1.0-sources.jar>
to /home/jenkins/jenkins-slave/maven-repositories/0/org/apache/sling/org.apache.sling.caconfig.spi/1.1.0/org.apache.sling.caconfig.spi-1.1.0-sources.jar
[INFO] 
[INFO] --- maven-bundle-plugin:3.2.0:install (default-install) @ org.apache.sling.caconfig.spi
---
[INFO] Local OBR update disabled (enable with -DobrRepository)
[INFO] 
[INFO] --- maven-deploy-plugin:2.8.2:deploy (default-deploy) @ org.apache.sling.caconfig.spi
---
[INFO] Uploading: https://repository.apache.org/service/local/staging/deploy/maven2/org/apache/sling/org.apache.sling.caconfig.spi/1.1.0/org.apache.sling.caconfig.spi-1.1.0.jar
[INFO] Uploading: https://repository.apache.org/service/local/staging/deploy/maven2/org/apache/sling/org.apache.sling.caconfig.spi/1.1.0/org.apache.sling.caconfig.spi-1.1.0.pom
[WARNING] Encountered issue during deployment: Failed to deploy artifacts: Could not transfer
artifact org.apache.sling:org.apache.sling.caconfig.spi:jar:1.1.0 from/to apache.releases.https
(https://repository.apache.org/service/local/staging/deploy/maven2): Failed to transfer file:
https://repository.apache.org/service/local/staging/deploy/maven2/org/apache/sling/org.apache.sling.caconfig.spi/1.1.0/org.apache.sling.caconfig.spi-1.1.0.jar.
Return code is: 401, ReasonPhrase: Unauthorized.
[INFO] Retrying deployment attempt 2 of 10
[INFO] Uploading: https://repository.apache.org/service/local/staging/deploy/maven2/org/apache/sling/org.apache.sling.caconfig.spi/1.1.0/org.apache.sling.caconfig.spi-1.1.0.jar
[INFO] Uploading: https://repository.apache.org/service/local/staging/deploy/maven2/org/apache/sling/org.apache.sling.caconfig.spi/1.1.0/org.apache.sling.caconfig.spi-1.1.0.pom
[WARNING] Encountered issue during deployment: Failed to deploy artifacts: Could not transfer
artifact org.apache.sling:org.apache.sling.caconfig.spi:jar:1.1.0 from/to apache.releases.https
(https://repository.apache.org/service/local/staging/deploy/maven2): Failed to transfer file:
https://repository.apache.org/service/local/staging/deploy/maven2/org/apache/sling/org.apache.sling.caconfig.spi/1.1.0/org.apache.sling.caconfig.spi-1.1.0.jar.
Return code is: 401, ReasonPhrase: Unauthorized.
[INFO] Retrying deployment attempt 3 of 10
[INFO] Uploading: https://repository.apache.org/service/local/staging/deploy/maven2/org/apache/sling/org.apache.sling.caconfig.spi/1.1.0/org.apache.sling.caconfig.spi-1.1.0.jar
[INFO] Uploading: https://repository.apache.org/service/local/staging/deploy/maven2/org/apache/sling/org.apache.sling.caconfig.spi/1.1.0/org.apache.sling.caconfig.spi-1.1.0.pom
[WARNING] Encountered issue during deployment: Failed to deploy artifacts: Could not transfer
artifact org.apache.sling:org.apache.sling.caconfig.spi:jar:1.1.0 from/to apache.releases.https
(https://repository.apache.org/service/local/staging/deploy/maven2): Failed to transfer file:
https://repository.apache.org/service/local/staging/deploy/maven2/org/apache/sling/org.apache.sling.caconfig.spi/1.1.0/org.apache.sling.caconfig.spi-1.1.0.jar.
Return code is: 401, ReasonPhrase: Unauthorized.
[INFO] Retrying deployment attempt 4 of 10
[INFO] Uploading: https://repository.apache.org/service/local/staging/deploy/maven2/org/apache/sling/org.apache.sling.caconfig.spi/1.1.0/org.apache.sling.caconfig.spi-1.1.0.jar
[INFO] Uploading: https://repository.apache.org/service/local/staging/deploy/maven2/org/apache/sling/org.apache.sling.caconfig.spi/1.1.0/org.apache.sling.caconfig.spi-1.1.0.pom
[WARNING] Encountered issue during deployment: Failed to deploy artifacts: Could not transfer
artifact org.apache.sling:org.apache.sling.caconfig.spi:jar:1.1.0 from/to apache.releases.https
(https://repository.apache.org/service/local/staging/deploy/maven2): Failed to transfer file:
https://repository.apache.org/service/local/staging/deploy/maven2/org/apache/sling/org.apache.sling.caconfig.spi/1.1.0/org.apache.sling.caconfig.spi-1.1.0.jar.
Return code is: 401, ReasonPhrase: Unauthorized.
[INFO] Retrying deployment attempt 5 of 10
[INFO] Uploading: https://repository.apache.org/service/local/staging/deploy/maven2/org/apache/sling/org.apache.sling.caconfig.spi/1.1.0/org.apache.sling.caconfig.spi-1.1.0.jar
[INFO] Uploading: https://repository.apache.org/service/local/staging/deploy/maven2/org/apache/sling/org.apache.sling.caconfig.spi/1.1.0/org.apache.sling.caconfig.spi-1.1.0.pom
[WARNING] Encountered issue during deployment: Failed to deploy artifacts: Could not transfer
artifact org.apache.sling:org.apache.sling.caconfig.spi:jar:1.1.0 from/to apache.releases.https
(https://repository.apache.org/service/local/staging/deploy/maven2): Failed to transfer file:
https://repository.apache.org/service/local/staging/deploy/maven2/org/apache/sling/org.apache.sling.caconfig.spi/1.1.0/org.apache.sling.caconfig.spi-1.1.0.jar.
Return code is: 401, ReasonPhrase: Unauthorized.
[INFO] Retrying deployment attempt 6 of 10
[INFO] Uploading: https://repository.apache.org/service/local/staging/deploy/maven2/org/apache/sling/org.apache.sling.caconfig.spi/1.1.0/org.apache.sling.caconfig.spi-1.1.0.jar
[INFO] Uploading: https://repository.apache.org/service/local/staging/deploy/maven2/org/apache/sling/org.apache.sling.caconfig.spi/1.1.0/org.apache.sling.caconfig.spi-1.1.0.pom
[WARNING] Encountered issue during deployment: Failed to deploy artifacts: Could not transfer
artifact org.apache.sling:org.apache.sling.caconfig.spi:jar:1.1.0 from/to apache.releases.https
(https://repository.apache.org/service/local/staging/deploy/maven2): Failed to transfer file:
https://repository.apache.org/service/local/staging/deploy/maven2/org/apache/sling/org.apache.sling.caconfig.spi/1.1.0/org.apache.sling.caconfig.spi-1.1.0.jar.
Return code is: 401, ReasonPhrase: Unauthorized.
[INFO] Retrying deployment attempt 7 of 10
[INFO] Uploading: https://repository.apache.org/service/local/staging/deploy/maven2/org/apache/sling/org.apache.sling.caconfig.spi/1.1.0/org.apache.sling.caconfig.spi-1.1.0.jar
[INFO] Uploading: https://repository.apache.org/service/local/staging/deploy/maven2/org/apache/sling/org.apache.sling.caconfig.spi/1.1.0/org.apache.sling.caconfig.spi-1.1.0.pom
[WARNING] Encountered issue during deployment: Failed to deploy artifacts: Could not transfer
artifact org.apache.sling:org.apache.sling.caconfig.spi:jar:1.1.0 from/to apache.releases.https
(https://repository.apache.org/service/local/staging/deploy/maven2): Failed to transfer file:
https://repository.apache.org/service/local/staging/deploy/maven2/org/apache/sling/org.apache.sling.caconfig.spi/1.1.0/org.apache.sling.caconfig.spi-1.1.0.jar.
Return code is: 401, ReasonPhrase: Unauthorized.
[INFO] Retrying deployment attempt 8 of 10
[INFO] Uploading: https://repository.apache.org/service/local/staging/deploy/maven2/org/apache/sling/org.apache.sling.caconfig.spi/1.1.0/org.apache.sling.caconfig.spi-1.1.0.jar
[INFO] Uploading: https://repository.apache.org/service/local/staging/deploy/maven2/org/apache/sling/org.apache.sling.caconfig.spi/1.1.0/org.apache.sling.caconfig.spi-1.1.0.pom
[WARNING] Encountered issue during deployment: Failed to deploy artifacts: Could not transfer
artifact org.apache.sling:org.apache.sling.caconfig.spi:jar:1.1.0 from/to apache.releases.https
(https://repository.apache.org/service/local/staging/deploy/maven2): Failed to transfer file:
https://repository.apache.org/service/local/staging/deploy/maven2/org/apache/sling/org.apache.sling.caconfig.spi/1.1.0/org.apache.sling.caconfig.spi-1.1.0.jar.
Return code is: 401, ReasonPhrase: Unauthorized.
[INFO] Retrying deployment attempt 9 of 10
[INFO] Uploading: https://repository.apache.org/service/local/staging/deploy/maven2/org/apache/sling/org.apache.sling.caconfig.spi/1.1.0/org.apache.sling.caconfig.spi-1.1.0.jar
[INFO] Uploading: https://repository.apache.org/service/local/staging/deploy/maven2/org/apache/sling/org.apache.sling.caconfig.spi/1.1.0/org.apache.sling.caconfig.spi-1.1.0.pom
[WARNING] Encountered issue during deployment: Failed to deploy artifacts: Could not transfer
artifact org.apache.sling:org.apache.sling.caconfig.spi:jar:1.1.0 from/to apache.releases.https
(https://repository.apache.org/service/local/staging/deploy/maven2): Failed to transfer file:
https://repository.apache.org/service/local/staging/deploy/maven2/org/apache/sling/org.apache.sling.caconfig.spi/1.1.0/org.apache.sling.caconfig.spi-1.1.0.jar.
Return code is: 401, ReasonPhrase: Unauthorized.
[INFO] Retrying deployment attempt 10 of 10
[INFO] Uploading: https://repository.apache.org/service/local/staging/deploy/maven2/org/apache/sling/org.apache.sling.caconfig.spi/1.1.0/org.apache.sling.caconfig.spi-1.1.0.jar
[INFO] Uploading: https://repository.apache.org/service/local/staging/deploy/maven2/org/apache/sling/org.apache.sling.caconfig.spi/1.1.0/org.apache.sling.caconfig.spi-1.1.0.pom
[JENKINS] Archiving disabled
[JENKINS] Archiving disabled[INFO] ------------------------------------------------------------------------
[INFO] BUILD FAILURE
[INFO] ------------------------------------------------------------------------
[INFO] Total time: 39.369 s
[INFO] Finished at: 2016-11-07T10:19:15+00:00

[INFO] Final Memory: 55M/706M
[INFO] ------------------------------------------------------------------------
Waiting for Jenkins to finish collecting data
[ERROR] Failed to execute goal org.apache.maven.plugins:maven-deploy-plugin:2.8.2:deploy (default-deploy)
on project org.apache.sling.caconfig.spi: Failed to deploy artifacts: Could not transfer artifact
org.apache.sling:org.apache.sling.caconfig.spi:jar:1.1.0 from/to apache.releases.https (https://repository.apache.org/service/local/staging/deploy/maven2):
Failed to transfer file: https://repository.apache.org/service/local/staging/deploy/maven2/org/apache/sling/org.apache.sling.caconfig.spi/1.1.0/org.apache.sling.caconfig.spi-1.1.0.jar.
Return code is: 401, ReasonPhrase: Unauthorized. -> [Help 1]
[ERROR] 
[ERROR] To see the full stack trace of the errors, re-run Maven with the -e switch.
[ERROR] Re-run Maven using the -X switch to enable full debug logging.
[ERROR] 
[ERROR] For more information about the errors and possible solutions, please read the following
articles:
[ERROR] [Help 1] http://cwiki.apache.org/confluence/display/MAVEN/MojoExecutionException
channel stopped
Recording test results
Found 13 test results

Mime
View raw message