sling-commits mailing list archives

Site index · List index
Message view « Date » · « Thread »
Top « Date » · « Thread »
From Apache Jenkins Server <jenk...@builds.apache.org>
Subject Build failed in Jenkins: sling-ide #78
Date Thu, 03 Nov 2016 11:14:03 GMT
See <https://builds.apache.org/job/sling-ide/78/changes>

Changes:

[kwin] SLING-6237 enable a specific XML validator for content-projects which ignores missing
grammar in an XML file

------------------------------------------
[...truncated 540 lines...]
[INFO] --- maven-resources-plugin:2.6:resources (default-resources) @ org.apache.sling.ide.impl-resource
---
[INFO] Using 'UTF-8' encoding to copy filtered resources.
[INFO] Copying 5 resources
[INFO] Copying 3 resources
[INFO] 
[INFO] --- tycho-compiler-plugin:0.22.0:compile (default-compile) @ org.apache.sling.ide.impl-resource
---
[INFO] Compiling 13 source files to <https://builds.apache.org/job/sling-ide/ws/impl-resource/target/classes>
[INFO] 
[INFO] --- maven-resources-plugin:2.6:testResources (default-testResources) @ org.apache.sling.ide.impl-resource
---
[INFO] Using 'UTF-8' encoding to copy filtered resources.
[INFO] skip non existing resourceDirectory <https://builds.apache.org/job/sling-ide/ws/impl-resource/src/test/resources>
[INFO] Copying 3 resources
[INFO] 
[INFO] --- target-platform-configuration:0.22.0:target-platform (default-target-platform)
@ org.apache.sling.ide.impl-resource ---
[INFO] 
[INFO] --- tycho-packaging-plugin:0.22.0:package-plugin (default-package-plugin) @ org.apache.sling.ide.impl-resource
---
[INFO] Building jar: <https://builds.apache.org/job/sling-ide/ws/impl-resource/target/org.apache.sling.ide.impl-resource-1.1.1-SNAPSHOT.jar>
[INFO] 
[INFO] --- tycho-p2-plugin:0.22.0:p2-metadata-default (default-p2-metadata-default) @ org.apache.sling.ide.impl-resource
---
[INFO] 
[INFO] --- maven-site-plugin:3.3:attach-descriptor (attach-descriptor) @ org.apache.sling.ide.impl-resource
---
[INFO] 
[INFO] --- ianal-maven-plugin:1.0-alpha-1:verify-legal-files (default) @ org.apache.sling.ide.impl-resource
---
[INFO] Checking legal files in: org.apache.sling.ide.impl-resource-1.1.1-SNAPSHOT.jar
[INFO] 
[INFO] --- apache-rat-plugin:0.10:check (default) @ org.apache.sling.ide.impl-resource ---
[INFO] 51 implicit excludes (use -debug for more details).
[INFO] Exclude: derby.log
[INFO] Exclude: .gitignore
[INFO] Exclude: README.md
[INFO] Exclude: *.launch
[INFO] Exclude: build.properties
[INFO] Exclude: .options
[INFO] Exclude: META-INF/MANIFEST.MF
[INFO] Exclude: **/*.binary
[INFO] Exclude: eclipse-test/**
[INFO] Exclude: source-bundle/target/**
[INFO] Exclude: .Xauthority-*
[INFO] 19 resources included (use -debug for more details)
Warning:  org.apache.xerces.jaxp.SAXParserImpl$JAXPSAXParser: Property 'http://www.oracle.com/xml/jaxp/properties/entityExpansionLimit'
is not recognized.
Compiler warnings:
  WARNING:  'org.apache.xerces.jaxp.SAXParserImpl: Property 'http://javax.xml.XMLConstants/property/accessExternalDTD'
is not recognized.'
Warning:  org.apache.xerces.parsers.SAXParser: Feature 'http://javax.xml.XMLConstants/feature/secure-processing'
is not recognized.
Warning:  org.apache.xerces.parsers.SAXParser: Property 'http://javax.xml.XMLConstants/property/accessExternalDTD'
is not recognized.
Warning:  org.apache.xerces.parsers.SAXParser: Property 'http://www.oracle.com/xml/jaxp/properties/entityExpansionLimit'
is not recognized.
[INFO] Rat check: Summary of files. Unapproved: 0 unknown: 0 generated: 0 approved: 17 licence.
[JENKINS] Archiving disabled
[INFO]                                                                         
[INFO] ------------------------------------------------------------------------
[INFO] Building Sling IDE Tools: Resource-based Implementation Tests 1.1.1-SNAPSHOT
[INFO] ------------------------------------------------------------------------
[INFO] 
[INFO] --- maven-clean-plugin:2.5:clean (default-clean) @ org.apache.sling.ide.impl-resource-test
---
[INFO] 
[INFO] --- maven-remote-resources-plugin:1.5:process (default) @ org.apache.sling.ide.impl-resource-test
---
[INFO] 
[INFO] --- maven-resources-plugin:2.6:resources (default-resources) @ org.apache.sling.ide.impl-resource-test
---
[INFO] Using 'UTF-8' encoding to copy filtered resources.
[INFO] Copying 0 resource
[INFO] Copying 3 resources
[INFO] 
[INFO] --- maven-compiler-plugin:3.1:compile (default-compile) @ org.apache.sling.ide.impl-resource-test
---
[INFO] No sources to compile
[INFO] 
[INFO] --- maven-resources-plugin:2.6:testResources (default-testResources) @ org.apache.sling.ide.impl-resource-test
---
[INFO] Using 'UTF-8' encoding to copy filtered resources.
[INFO] Copying 2 resources
[INFO] Copying 3 resources
[INFO] 
[INFO] --- maven-compiler-plugin:3.1:testCompile (default-testCompile) @ org.apache.sling.ide.impl-resource-test
---
[INFO] Changes detected - recompiling the module!
[INFO] Compiling 1 source file to <https://builds.apache.org/job/sling-ide/ws/impl-resource-test/target/test-classes>
[INFO] 
[INFO] --- maven-surefire-plugin:2.16:test (default-test) @ org.apache.sling.ide.impl-resource-test
---
[INFO] Surefire report directory: <https://builds.apache.org/job/sling-ide/ws/impl-resource-test/target/surefire-reports>

-------------------------------------------------------
 T E S T S
-------------------------------------------------------
Running org.apache.sling.ide.impl.resource.serialization.SimpleXmlSerializationManagerTest
Tests run: 10, Failures: 0, Errors: 0, Skipped: 0, Time elapsed: 0.207 sec - in org.apache.sling.ide.impl.resource.serialization.SimpleXmlSerializationManagerTest

Results :

Tests run: 10, Failures: 0, Errors: 0, Skipped: 0

[JENKINS] Recording test results
[INFO] 
[INFO] --- maven-jar-plugin:2.4:jar (default-jar) @ org.apache.sling.ide.impl-resource-test
---
[INFO] Building jar: <https://builds.apache.org/job/sling-ide/ws/impl-resource-test/target/org.apache.sling.ide.impl-resource-test-1.1.1-SNAPSHOT.jar>
[INFO] 
[INFO] --- maven-site-plugin:3.3:attach-descriptor (attach-descriptor) @ org.apache.sling.ide.impl-resource-test
---
[INFO] 
[INFO] --- ianal-maven-plugin:1.0-alpha-1:verify-legal-files (default) @ org.apache.sling.ide.impl-resource-test
---
[INFO] Checking legal files in: org.apache.sling.ide.impl-resource-test-1.1.1-SNAPSHOT.jar
[INFO] 
[INFO] --- apache-rat-plugin:0.10:check (default) @ org.apache.sling.ide.impl-resource-test
---
[INFO] 51 implicit excludes (use -debug for more details).
[INFO] Exclude: derby.log
[INFO] Exclude: .gitignore
[INFO] Exclude: README.md
[INFO] Exclude: *.launch
[INFO] Exclude: build.properties
[INFO] Exclude: .options
[INFO] Exclude: META-INF/MANIFEST.MF
[INFO] Exclude: **/*.binary
[INFO] Exclude: eclipse-test/**
[INFO] Exclude: source-bundle/target/**
[INFO] Exclude: .Xauthority-*
[INFO] 6 resources included (use -debug for more details)
Warning:  org.apache.xerces.jaxp.SAXParserImpl$JAXPSAXParser: Property 'http://www.oracle.com/xml/jaxp/properties/entityExpansionLimit'
is not recognized.
Compiler warnings:
  WARNING:  'org.apache.xerces.jaxp.SAXParserImpl: Property 'http://javax.xml.XMLConstants/property/accessExternalDTD'
is not recognized.'
Warning:  org.apache.xerces.parsers.SAXParser: Feature 'http://javax.xml.XMLConstants/feature/secure-processing'
is not recognized.
Warning:  org.apache.xerces.parsers.SAXParser: Property 'http://javax.xml.XMLConstants/property/accessExternalDTD'
is not recognized.
Warning:  org.apache.xerces.parsers.SAXParser: Property 'http://www.oracle.com/xml/jaxp/properties/entityExpansionLimit'
is not recognized.
[INFO] Rat check: Summary of files. Unapproved: 0 unknown: 0 generated: 0 approved: 4 licence.
[JENKINS] Archiving disabled
[INFO]                                                                         
[INFO] ------------------------------------------------------------------------
[INFO] Building Sling IDE Tools: Eclipse Core 1.1.1-SNAPSHOT
[INFO] ------------------------------------------------------------------------
[INFO] 
[INFO] --- maven-clean-plugin:2.5:clean (default-clean) @ org.apache.sling.ide.eclipse-core
---
[INFO] 
[INFO] --- tycho-packaging-plugin:0.22.0:build-qualifier (default-build-qualifier) @ org.apache.sling.ide.eclipse-core
---
[INFO] The project's OSGi version is 1.1.1.201611031113
[INFO] 
[INFO] --- tycho-packaging-plugin:0.22.0:validate-id (default-validate-id) @ org.apache.sling.ide.eclipse-core
---
[INFO] 
[INFO] --- tycho-packaging-plugin:0.22.0:validate-version (default-validate-version) @ org.apache.sling.ide.eclipse-core
---
[INFO] 
[INFO] --- maven-remote-resources-plugin:1.5:process (default) @ org.apache.sling.ide.eclipse-core
---
[INFO] 
[INFO] --- maven-resources-plugin:2.6:resources (default-resources) @ org.apache.sling.ide.eclipse-core
---
[INFO] Using 'UTF-8' encoding to copy filtered resources.
[INFO] Copying 4 resources
[INFO] Copying 3 resources
[INFO] 
[INFO] --- tycho-compiler-plugin:0.22.0:compile (default-compile) @ org.apache.sling.ide.eclipse-core
---
[INFO] Compiling 50 source files to <https://builds.apache.org/job/sling-ide/ws/eclipse-core/target/classes>
[INFO] 
[INFO] --- maven-resources-plugin:2.6:testResources (default-testResources) @ org.apache.sling.ide.eclipse-core
---
[INFO] Using 'UTF-8' encoding to copy filtered resources.
[INFO] skip non existing resourceDirectory <https://builds.apache.org/job/sling-ide/ws/eclipse-core/src/test/resources>
[INFO] Copying 3 resources
[INFO] 
[INFO] --- target-platform-configuration:0.22.0:target-platform (default-target-platform)
@ org.apache.sling.ide.eclipse-core ---
[INFO] 
[INFO] --- tycho-packaging-plugin:0.22.0:package-plugin (default-package-plugin) @ org.apache.sling.ide.eclipse-core
---
[INFO] Building jar: <https://builds.apache.org/job/sling-ide/ws/eclipse-core/target/org.apache.sling.ide.eclipse-core-1.1.1-SNAPSHOT.jar>
[INFO] 
[INFO] --- tycho-p2-plugin:0.22.0:p2-metadata-default (default-p2-metadata-default) @ org.apache.sling.ide.eclipse-core
---
[INFO] 
[INFO] --- maven-site-plugin:3.3:attach-descriptor (attach-descriptor) @ org.apache.sling.ide.eclipse-core
---
[INFO] 
[INFO] --- ianal-maven-plugin:1.0-alpha-1:verify-legal-files (default) @ org.apache.sling.ide.eclipse-core
---
[INFO] Checking legal files in: org.apache.sling.ide.eclipse-core-1.1.1-SNAPSHOT.jar
[INFO] 
[INFO] --- apache-rat-plugin:0.10:check (default) @ org.apache.sling.ide.eclipse-core ---
[INFO] 51 implicit excludes (use -debug for more details).
[INFO] Exclude: derby.log
[INFO] Exclude: .gitignore
[INFO] Exclude: README.md
[INFO] Exclude: *.launch
[INFO] Exclude: build.properties
[INFO] Exclude: .options
[INFO] Exclude: META-INF/MANIFEST.MF
[INFO] Exclude: **/*.binary
[INFO] Exclude: eclipse-test/**
[INFO] Exclude: source-bundle/target/**
[INFO] Exclude: .Xauthority-*
[INFO] 55 resources included (use -debug for more details)
Warning:  org.apache.xerces.jaxp.SAXParserImpl$JAXPSAXParser: Property 'http://www.oracle.com/xml/jaxp/properties/entityExpansionLimit'
is not recognized.
Compiler warnings:
  WARNING:  'org.apache.xerces.jaxp.SAXParserImpl: Property 'http://javax.xml.XMLConstants/property/accessExternalDTD'
is not recognized.'
Warning:  org.apache.xerces.parsers.SAXParser: Feature 'http://javax.xml.XMLConstants/feature/secure-processing'
is not recognized.
Warning:  org.apache.xerces.parsers.SAXParser: Property 'http://javax.xml.XMLConstants/property/accessExternalDTD'
is not recognized.
Warning:  org.apache.xerces.parsers.SAXParser: Property 'http://www.oracle.com/xml/jaxp/properties/entityExpansionLimit'
is not recognized.
[INFO] Rat check: Summary of files. Unapproved: 1 unknown: 1 generated: 0 approved: 52 licence.
[JENKINS] Archiving disabled
[JENKINS] Archiving disabled
[JENKINS] Archiving disabled
[JENKINS] Archiving disabled
[JENKINS] Archiving disabled
[JENKINS] Archiving disabled
[JENKINS] Archiving disabled
[JENKINS] Archiving disabled
[JENKINS] Archiving disabled
[JENKINS] Archiving disabled
[JENKINS] Archiving disabled
[JENKINS] Archiving disabled
[JENKINS] Archiving disabled
[JENKINS] Archiving disabled
[JENKINS] Archiving disabled
[JENKINS] Archiving disabled
[JENKINS] Archiving disabled
[JENKINS] Archiving disabled
[JENKINS] Archiving disabled
[JENKINS] Archiving disabled
[JENKINS] Archiving disabled
[JENKINS] Archiving disabled
[JENKINS] Archiving disabled[INFO] ------------------------------------------------------------------------
[INFO] Reactor Summary:
[INFO] 
[INFO] Sling IDE Tools: Reactor ........................... SUCCESS [  6.788 s]
[INFO] Sling IDE Tools: Target definition ................. SUCCESS [  0.700 s]
[INFO] Sling IDE Tools: FileVault wrapper ................. SUCCESS [  4.013 s]
[INFO] Sling IDE Tools: API ............................... SUCCESS [  2.541 s]
[INFO] Sling IDE Tools: API Tests ......................... SUCCESS [ 12.141 s]
[INFO] Sling IDE Tools: Embedded Artifacts ................ SUCCESS [  1.208 s]
[INFO] Sling IDE Tools: Resource-based Implementation ..... SUCCESS [  1.401 s]
[INFO] Sling IDE Tools: Resource-based Implementation Tests SUCCESS [  1.831 s]
[INFO] Sling IDE Tools: Eclipse Core ...................... FAILURE [  2.450 s]
[INFO] Sling IDE Tools: FileVault implementation .......... SKIPPED
[INFO] Sling IDE Tools: FileVault Implementation Tests .... SKIPPED
[INFO] Sling IDE Tools: Eclipse UI ........................ SKIPPED
[INFO] Sling IDE Tools: Eclipse Feature ................... SKIPPED
[INFO] Sling IDE Tools: Eclipse M2Eclipse-based Core ...... SKIPPED
[INFO] Sling IDE Tools: Eclipse M2Eclipse-based UI ........ SKIPPED
[INFO] Sling IDE Tools: Eclipse Sightly Core .............. SKIPPED
[INFO] Sling IDE Tools: Eclipse Sightly UI ................ SKIPPED
[INFO] Sling IDE Tools: Sightly Feature ................... SKIPPED
[INFO] Sling IDE Tools: Eclipse Tests ..................... SKIPPED
[INFO] Sling IDE Tools: Eclipse M2Eclipse-based Tests ..... SKIPPED
[INFO] Sling IDE Tools: M2Eclipse-based Feature ........... SKIPPED
[INFO] Sling IDE Tools: Update Site ....................... SKIPPED
[INFO] ------------------------------------------------------------------------
[INFO] BUILD FAILURE
[INFO] ------------------------------------------------------------------------
[INFO] Total time: 01:18 min
[INFO] Finished at: 2016-11-03T11:13:55+00:00

[INFO] Final Memory: 123M/835M
[INFO] ------------------------------------------------------------------------
[ERROR] Failed to execute goal org.apache.rat:apache-rat-plugin:0.10:check (default) on project
org.apache.sling.ide.eclipse-core: Too many files with unapproved license: 1 See RAT report
in: <https://builds.apache.org/job/sling-ide/ws/eclipse-core/target/rat.txt> -> [Help
1]
[ERROR] 
[ERROR] To see the full stack trace of the errors, re-run Maven with the -e switch.
[ERROR] Re-run Maven using the -X switch to enable full debug logging.
[ERROR] 
[ERROR] For more information about the errors and possible solutions, please read the following
articles:
[ERROR] [Help 1] http://cwiki.apache.org/confluence/display/MAVEN/MojoFailureException
[ERROR] 
[ERROR] After correcting the problems, you can resume the build with the command
[ERROR]   mvn <goals> -rf :org.apache.sling.ide.eclipse-core
Xvfb stopping
channel stopped
Found 39 test results
Found 11 test results

Mime
View raw message