sling-commits mailing list archives

Site index · List index
Message view « Date » · « Thread »
Top « Date » · « Thread »
From Apache Jenkins Server <jenk...@builds.apache.org>
Subject Build failed in Jenkins: sling-contrib-crankstart-launcher-1.7 #1
Date Wed, 05 Oct 2016 16:12:06 GMT
See <https://builds.apache.org/job/sling-contrib-crankstart-launcher-1.7/1/>

------------------------------------------
Started by user rombert
[EnvInject] - Loading node environment variables.
Building remotely on jenkins-test-39e (Ubuntu ubuntu jenkins-cloud-8GB jenkins-cloud-4GB cloud-slave)
in workspace <https://builds.apache.org/job/sling-contrib-crankstart-launcher-1.7/ws/>
Checking out a fresh workspace because there's no workspace at <https://builds.apache.org/job/sling-contrib-crankstart-launcher-1.7/ws/>
Cleaning local Directory .
Checking out https://svn.apache.org/repos/asf/sling/trunk/contrib/crankstart/launcher at revision
'2016-10-05T16:11:08.399 +0000'
A         pom.xml
A         src
A         src/test
A         src/test/java
A         src/test/java/org
A         src/test/java/org/apache
A         src/test/java/org/apache/sling
A         src/test/java/org/apache/sling/crankstart
A         src/test/java/org/apache/sling/crankstart/launcher
A         src/test/java/org/apache/sling/crankstart/launcher/BasicLauncherIT.java
A         src/test/java/org/apache/sling/crankstart/launcher/PreemptiveAuthInterceptor.java
A         src/test/java/org/apache/sling/crankstart/launcher/U.java
A         src/test/java/org/apache/sling/crankstart/launcher/RunModeAIT.java
A         src/test/java/org/apache/sling/crankstart/launcher/NestedModelsMergerTest.java
A         src/test/java/org/apache/sling/crankstart/launcher/RunModeBIT.java
A         src/test/resources
A         src/test/resources/provisioning-model
A         src/test/resources/provisioning-model/sling-extensions.txt
A         src/test/resources/provisioning-model/base.txt
A         src/test/resources/provisioning-model/crankstart-tests.txt
A         src/test/resources/provisioning-model/start-level-99.txt
A         src/test/resources/sling-launchpad.txt
A         src/test/resources/crankstart-model.txt
A         src/main
A         src/main/java
A         src/main/java/org
A         src/main/java/org/apache
A         src/main/java/org/apache/sling
A         src/main/java/org/apache/sling/crankstart
A         src/main/java/org/apache/sling/crankstart/launcher
A         src/main/java/org/apache/sling/crankstart/launcher/PropertiesVariableResolver.java
AU        src/main/java/org/apache/sling/crankstart/launcher/LauncherListener.java
A         src/main/java/org/apache/sling/crankstart/launcher/MavenResolver.java
A         src/main/java/org/apache/sling/crankstart/launcher/NestedModelsMerger.java
A         src/main/java/org/apache/sling/crankstart/launcher/BundlesInstaller.java
A         src/main/java/org/apache/sling/crankstart/launcher/Configurations.java
A         src/main/java/org/apache/sling/crankstart/launcher/FrameworkProperties.java
A         src/main/java/org/apache/sling/crankstart/launcher/FrameworkSetup.java
A         src/main/java/org/apache/sling/crankstart/launcher/RunModeFilter.java
A         src/main/java/org/apache/sling/crankstart/launcher/ArtifactsVisitor.java
A         src/main/java/org/apache/sling/crankstart/launcher/FeatureFilter.java
A         src/main/java/org/apache/sling/crankstart/launcher/Launcher.java
A         src/main/java/org/apache/sling/crankstart/junit
A         src/main/java/org/apache/sling/crankstart/junit/CrankstartSetup.java
 U        .
At revision 1763463

Parsing POMs
Discovered a new module org.apache.sling:org.apache.sling.crankstart.launcher Apache Sling
Crankstart Launcher
Modules changed, recalculating dependency graph
Established TCP socket on 32808
maven32-agent.jar already up to date
maven32-interceptor.jar already up to date
maven3-interceptor-commons.jar already up to date
[sling-contrib-crankstart-launcher-1.7] $ /home/jenkins/tools/java/latest1.7/bin/java -Xmx2g
-Xms256m -XX:MaxPermSize=512m -cp /home/jenkins/jenkins-slave/maven32-agent.jar:/home/jenkins/tools/maven/apache-maven-3.3.9/boot/plexus-classworlds-2.5.2.jar:/home/jenkins/tools/maven/apache-maven-3.3.9/conf/logging
jenkins.maven3.agent.Maven32Main /home/jenkins/tools/maven/apache-maven-3.3.9 /home/jenkins/jenkins-slave/slave.jar
/home/jenkins/jenkins-slave/maven32-interceptor.jar /home/jenkins/jenkins-slave/maven3-interceptor-commons.jar
32808
<===[JENKINS REMOTING CAPACITY]===>   channel started
Executing Maven:  -B -f <https://builds.apache.org/job/sling-contrib-crankstart-launcher-1.7/ws/pom.xml>
-Dmaven.repo.local=/home/jenkins/jenkins-slave/maven-repositories/0 -U clean deploy
[INFO] Scanning for projects...
[WARNING] 
[WARNING] Some problems were encountered while building the effective model for org.apache.sling:org.apache.sling.crankstart.launcher:jar:1.9.9-SNAPSHOT
[WARNING] 'build.plugins.plugin.version' for org.apache.maven.plugins:maven-failsafe-plugin
is missing. @ line 96, column 21
[WARNING] 
[WARNING] It is highly recommended to fix these problems because they threaten the stability
of your build.
[WARNING] 
[WARNING] For this reason, future Maven versions might no longer support building such malformed
projects.
[WARNING] 
[INFO]                                                                         
[INFO] ------------------------------------------------------------------------
[INFO] Building Apache Sling Crankstart Launcher 1.9.9-SNAPSHOT
[INFO] ------------------------------------------------------------------------
[INFO] Downloading: https://repo.maven.apache.org/maven2/org/apache/maven/plugins/maven-failsafe-plugin/maven-metadata.xml
[INFO] Downloaded: https://repo.maven.apache.org/maven2/org/apache/maven/plugins/maven-failsafe-plugin/maven-metadata.xml
(2 KB at 2.9 KB/sec)
[INFO] Downloading: https://repo.maven.apache.org/maven2/org/apache/maven/plugins/maven-install-plugin/2.3.1/maven-install-plugin-2.3.1.pom
[INFO] Downloaded: https://repo.maven.apache.org/maven2/org/apache/maven/plugins/maven-install-plugin/2.3.1/maven-install-plugin-2.3.1.pom
(5 KB at 366.9 KB/sec)
[INFO] Downloading: https://repo.maven.apache.org/maven2/org/apache/maven/plugins/maven-install-plugin/2.3.1/maven-install-plugin-2.3.1.jar
[INFO] Downloaded: https://repo.maven.apache.org/maven2/org/apache/maven/plugins/maven-install-plugin/2.3.1/maven-install-plugin-2.3.1.jar
(23 KB at 823.2 KB/sec)
[INFO] Downloading: https://repo.maven.apache.org/maven2/org/apache/maven/plugins/maven-deploy-plugin/2.6/maven-deploy-plugin-2.6.pom
[INFO] Downloaded: https://repo.maven.apache.org/maven2/org/apache/maven/plugins/maven-deploy-plugin/2.6/maven-deploy-plugin-2.6.pom
(6 KB at 261.0 KB/sec)
[INFO] Downloading: https://repo.maven.apache.org/maven2/org/apache/maven/plugins/maven-deploy-plugin/2.6/maven-deploy-plugin-2.6.jar
[INFO] Downloaded: https://repo.maven.apache.org/maven2/org/apache/maven/plugins/maven-deploy-plugin/2.6/maven-deploy-plugin-2.6.jar
(24 KB at 1035.2 KB/sec)
[INFO] Downloading: http://repository.apache.org/snapshots/org/apache/sling/org.apache.sling.cransktart.test.model/1.9.9-SNAPSHOT/maven-metadata.xml
[INFO] Downloading: http://repository.apache.org/snapshots/org/apache/sling/org.apache.sling.cransktart.test.model/1.9.9-SNAPSHOT/org.apache.sling.cransktart.test.model-1.9.9-SNAPSHOT.pom
[WARNING] The POM for org.apache.sling:org.apache.sling.cransktart.test.model:txt:1.9.9-SNAPSHOT
is missing, no dependency information available
[INFO] Downloading: http://repository.apache.org/snapshots/org/apache/sling/org.apache.sling.crankstart.test.services/1.9.9-SNAPSHOT/maven-metadata.xml
[INFO] Downloading: http://repository.apache.org/snapshots/org/apache/sling/org.apache.sling.crankstart.test.services/1.9.9-SNAPSHOT/org.apache.sling.crankstart.test.services-1.9.9-SNAPSHOT.pom
[WARNING] The POM for org.apache.sling:org.apache.sling.crankstart.test.services:jar:1.9.9-SNAPSHOT
is missing, no dependency information available
[INFO] Downloading: http://repository.apache.org/snapshots/org/apache/sling/org.apache.sling.cransktart.test.model/1.9.9-SNAPSHOT/org.apache.sling.cransktart.test.model-1.9.9-SNAPSHOT.txt
[INFO] Downloading: http://repository.apache.org/snapshots/org/apache/sling/org.apache.sling.crankstart.test.services/1.9.9-SNAPSHOT/org.apache.sling.crankstart.test.services-1.9.9-SNAPSHOT.jar
[JENKINS] Archiving disabled
[JENKINS] Archiving disabled
[INFO] ------------------------------------------------------------------------
[INFO] BUILD FAILURE
[INFO] ------------------------------------------------------------------------
[INFO] Total time: 5.898 s
[INFO] Finished at: 2016-10-05T16:12:10+00:00
[INFO] Final Memory: 13M/246M
[INFO] ------------------------------------------------------------------------
Waiting for Jenkins to finish collecting data
[ERROR] Failed to execute goal on project org.apache.sling.crankstart.launcher: Could not
resolve dependencies for project org.apache.sling:org.apache.sling.crankstart.launcher:jar:1.9.9-SNAPSHOT:
The following artifacts could not be resolved: org.apache.sling:org.apache.sling.cransktart.test.model:txt:1.9.9-SNAPSHOT,
org.apache.sling:org.apache.sling.crankstart.test.services:jar:1.9.9-SNAPSHOT: Could not find
artifact org.apache.sling:org.apache.sling.cransktart.test.model:txt:1.9.9-SNAPSHOT in Nexus
(http://repository.apache.org/snapshots) -> [Help 1]
[ERROR] 
[ERROR] To see the full stack trace of the errors, re-run Maven with the -e switch.
[ERROR] Re-run Maven using the -X switch to enable full debug logging.
[ERROR] 
[ERROR] For more information about the errors and possible solutions, please read the following
articles:
[ERROR] [Help 1] http://cwiki.apache.org/confluence/display/MAVEN/DependencyResolutionException
channel stopped
Recording test results

Mime
View raw message