sling-commits mailing list archives

Site index · List index
Message view « Date » · « Thread »
Top « Date » · « Thread »
From Apache Jenkins Server <jenk...@builds.apache.org>
Subject Build failed in Jenkins: sling-karaf-org.apache.sling.karaf-distribution-1.8 #5
Date Thu, 27 Oct 2016 09:08:09 GMT
See <https://builds.apache.org/job/sling-karaf-org.apache.sling.karaf-distribution-1.8/5/changes>

Changes:

[olli] add feature pax-url-classpath-sling (for repoinit, remove when KARAF-4707 is done)

------------------------------------------
Started by upstream project "sling-karaf-org.apache.sling.karaf-features-1.7" build number
4
originally caused by:
 Started by an SCM change
[EnvInject] - Loading node environment variables.
Building remotely on ubuntu-eu2 (Ubuntu ubuntu ubuntu-eu docker) in workspace <https://builds.apache.org/job/sling-karaf-org.apache.sling.karaf-distribution-1.8/ws/>
Checking out a fresh workspace because there's no workspace at <https://builds.apache.org/job/sling-karaf-org.apache.sling.karaf-distribution-1.8/ws/>
Cleaning local Directory .
Checking out https://svn.apache.org/repos/asf/sling/trunk/karaf/org.apache.sling.karaf-distribution
at revision '2016-10-27T09:06:53.421 +0000'
A         src
A         src/main
A         src/main/resources
A         src/main/resources/etc
AU        src/main/resources/etc/custom.properties
A         pom.xml
At revision 1766791

Parsing POMs
Established TCP socket on 60510
maven32-agent.jar already up to date
maven32-interceptor.jar already up to date
maven3-interceptor-commons.jar already up to date
[sling-karaf-org.apache.sling.karaf-distribution-1.8] $ /home/jenkins/tools/java/latest1.8/bin/java
-Xmx2g -Xms256m -XX:MaxPermSize=512m -cp /home/jenkins/jenkins-slave/maven32-agent.jar:/home/jenkins/tools/maven/apache-maven-3.3.9/boot/plexus-classworlds-2.5.2.jar:/home/jenkins/tools/maven/apache-maven-3.3.9/conf/logging
jenkins.maven3.agent.Maven32Main /home/jenkins/tools/maven/apache-maven-3.3.9 /home/jenkins/jenkins-slave/slave.jar
/home/jenkins/jenkins-slave/maven32-interceptor.jar /home/jenkins/jenkins-slave/maven3-interceptor-commons.jar
60510
Java HotSpot(TM) 64-Bit Server VM warning: ignoring option MaxPermSize=512m; support was removed
in 8.0
<===[JENKINS REMOTING CAPACITY]===>   channel started
Executing Maven:  -B -f <https://builds.apache.org/job/sling-karaf-org.apache.sling.karaf-distribution-1.8/ws/pom.xml>
-Dmaven.repo.local=/home/jenkins/jenkins-slave/maven-repositories/1 -U clean verify
[INFO] Scanning for projects...
[INFO]                                                                         
[INFO] ------------------------------------------------------------------------
[INFO] Building Apache Sling - Karaf Distribution 0.1.1-SNAPSHOT
[INFO] ------------------------------------------------------------------------
[INFO] Downloading: http://repository.apache.org/snapshots/org/apache/sling/org.apache.sling.karaf-features/0.1.1-SNAPSHOT/maven-metadata.xml
[INFO] Downloaded: http://repository.apache.org/snapshots/org/apache/sling/org.apache.sling.karaf-features/0.1.1-SNAPSHOT/maven-metadata.xml
(2 KB at 2.2 KB/sec)
[INFO] Downloading: http://repository.apache.org/snapshots/org/apache/sling/org.apache.sling.karaf-features/0.1.1-SNAPSHOT/org.apache.sling.karaf-features-0.1.1-20161027.090618-3.pom
[INFO] Downloaded: http://repository.apache.org/snapshots/org/apache/sling/org.apache.sling.karaf-features/0.1.1-SNAPSHOT/org.apache.sling.karaf-features-0.1.1-20161027.090618-3.pom
(3 KB at 7.3 KB/sec)
[INFO] Downloading: http://repository.apache.org/snapshots/org/apache/sling/org.apache.sling.karaf-configs/0.1.1-SNAPSHOT/maven-metadata.xml
[INFO] Downloaded: http://repository.apache.org/snapshots/org/apache/sling/org.apache.sling.karaf-configs/0.1.1-SNAPSHOT/maven-metadata.xml
(8 KB at 19.7 KB/sec)
[INFO] Downloading: http://repository.apache.org/snapshots/org/apache/sling/org.apache.sling.karaf-features/0.1.1-SNAPSHOT/org.apache.sling.karaf-features-0.1.1-20161027.090618-3-features.xml
[INFO] Downloading: http://repository.apache.org/snapshots/org/apache/sling/org.apache.sling.karaf-configs/0.1.1-SNAPSHOT/org.apache.sling.karaf-configs-0.1.1-SNAPSHOT-org.apache.sling.jcr.base.internal.LoginAdminWhitelistImpl.config
[INFO] Downloading: http://repository.apache.org/snapshots/org/apache/sling/org.apache.sling.karaf-configs/0.1.1-SNAPSHOT/org.apache.sling.karaf-configs-0.1.1-SNAPSHOT-org.apache.sling.jcr.repoinit.impl.RepositoryInitializer.config
[INFO] Downloaded: http://repository.apache.org/snapshots/org/apache/sling/org.apache.sling.karaf-features/0.1.1-SNAPSHOT/org.apache.sling.karaf-features-0.1.1-20161027.090618-3-features.xml
(39 KB at 77.5 KB/sec)
[JENKINS] Archiving disabled
[JENKINS] Archiving disabled[INFO] ------------------------------------------------------------------------
[INFO] BUILD FAILURE

[INFO] ------------------------------------------------------------------------
[INFO] Total time: 19.192 s
[INFO] Finished at: 2016-10-27T09:08:08+00:00
[INFO] Final Memory: 23M/309M
[INFO] ------------------------------------------------------------------------
Waiting for Jenkins to finish collecting data
[ERROR] Failed to execute goal on project org.apache.sling.karaf-distribution: Could not resolve
dependencies for project org.apache.sling:org.apache.sling.karaf-distribution:karaf-assembly:0.1.1-SNAPSHOT:
The following artifacts could not be resolved: org.apache.sling:org.apache.sling.karaf-configs:config:org.apache.sling.jcr.base.internal.LoginAdminWhitelistImpl:0.1.1-SNAPSHOT,
org.apache.sling:org.apache.sling.karaf-configs:config:org.apache.sling.jcr.repoinit.impl.RepositoryInitializer:0.1.1-SNAPSHOT:
Could not find artifact org.apache.sling:org.apache.sling.karaf-configs:config:org.apache.sling.jcr.base.internal.LoginAdminWhitelistImpl:0.1.1-SNAPSHOT
in Nexus (http://repository.apache.org/snapshots) -> [Help 1]
[ERROR] 
[ERROR] To see the full stack trace of the errors, re-run Maven with the -e switch.
[ERROR] Re-run Maven using the -X switch to enable full debug logging.
[ERROR] 
[ERROR] For more information about the errors and possible solutions, please read the following
articles:
[ERROR] [Help 1] http://cwiki.apache.org/confluence/display/MAVEN/DependencyResolutionException
channel stopped
Recording test results

Mime
View raw message