sling-commits mailing list archives

Site index · List index
Message view « Date » · « Thread »
Top « Date » · « Thread »
From Apache Jenkins Server <jenk...@builds.apache.org>
Subject Build failed in Jenkins: sling-samples-inplace-integration-test-1.7 #1
Date Tue, 11 Oct 2016 15:04:51 GMT
See <https://builds.apache.org/job/sling-samples-inplace-integration-test-1.7/1/>

------------------------------------------
Started by an SCM change
[EnvInject] - Loading node environment variables.
Building remotely on ubuntu-6 (Ubuntu yahoo-not-h2 ubuntu docker) in workspace <https://builds.apache.org/job/sling-samples-inplace-integration-test-1.7/ws/>
Checking out a fresh workspace because there's no workspace at <https://builds.apache.org/job/sling-samples-inplace-integration-test-1.7/ws/>
Cleaning local Directory .
Checking out https://svn.apache.org/repos/asf/sling/trunk/samples/inplace-integration-test
at revision '2016-10-11T15:03:20.468 +0000'
A         .gitignore
A         src
A         src/main
A         src/main/java
A         src/main/java/org
A         src/main/java/org/apache
A         src/main/java/org/apache/sling
A         src/main/java/org/apache/sling/samples
A         src/main/java/org/apache/sling/samples/itdemo
A         src/main/java/org/apache/sling/samples/itdemo/impl
A         src/main/java/org/apache/sling/samples/itdemo/impl/SimpleServlet.java
A         src/test
A         src/test/java
A         src/test/java/org
A         src/test/java/org/apache
A         src/test/java/org/apache/sling
A         src/test/java/org/apache/sling/samples
A         src/test/java/org/apache/sling/samples/itdemo
A         src/test/java/org/apache/sling/samples/itdemo/SimpleServletIT.java
A         src/test/java/org/apache/sling/samples/itdemo/InitialContentIT.java
A         pom.xml
A         README.txt
 U        .
At revision 1764261

Parsing POMs
Discovered a new module org.apache.sling.samples:inplace-integration-test Sample In-Place
Integration Test
Modules changed, recalculating dependency graph
Established TCP socket on 41208
maven32-agent.jar already up to date
maven32-interceptor.jar already up to date
maven3-interceptor-commons.jar already up to date
[sling-samples-inplace-integration-test-1.7] $ /home/jenkins/tools/java/latest1.7/bin/java
-Xmx2g -Xms256m -XX:MaxPermSize=512m -cp /home/jenkins/jenkins-slave/maven32-agent.jar:/home/jenkins/tools/maven/apache-maven-3.3.9/boot/plexus-classworlds-2.5.2.jar:/home/jenkins/tools/maven/apache-maven-3.3.9/conf/logging
jenkins.maven3.agent.Maven32Main /home/jenkins/tools/maven/apache-maven-3.3.9 /home/jenkins/jenkins-slave/slave.jar
/home/jenkins/jenkins-slave/maven32-interceptor.jar /home/jenkins/jenkins-slave/maven3-interceptor-commons.jar
41208
<===[JENKINS REMOTING CAPACITY]===>   channel started
Executing Maven:  -B -f <https://builds.apache.org/job/sling-samples-inplace-integration-test-1.7/ws/pom.xml>
-Dmaven.repo.local=/home/jenkins/jenkins-slave/maven-repositories/0 -U clean deploy
[INFO] Scanning for projects...
[INFO] Downloading: https://repo.maven.apache.org/maven2/org/apache/felix/maven-bundle-plugin/2.0.1/maven-bundle-plugin-2.0.1.pom
[INFO] Downloaded: https://repo.maven.apache.org/maven2/org/apache/felix/maven-bundle-plugin/2.0.1/maven-bundle-plugin-2.0.1.pom
(5 KB at 4.3 KB/sec)
[INFO] Downloading: https://repo.maven.apache.org/maven2/org/apache/felix/maven-bundle-plugin/2.0.1/maven-bundle-plugin-2.0.1.jar
[INFO] Downloaded: https://repo.maven.apache.org/maven2/org/apache/felix/maven-bundle-plugin/2.0.1/maven-bundle-plugin-2.0.1.jar
(176 KB at 633.6 KB/sec)
[WARNING] 
[WARNING] Some problems were encountered while building the effective model for org.apache.sling.samples:inplace-integration-test:bundle:0.0.1-SNAPSHOT
[WARNING] 'build.plugins.plugin.version' for org.apache.maven.plugins:maven-compiler-plugin
is missing. @ line 164, column 21
[WARNING] 'build.plugins.plugin.version' for org.apache.maven.plugins:maven-war-plugin is
missing. @ line 102, column 21
[WARNING] 
[WARNING] It is highly recommended to fix these problems because they threaten the stability
of your build.
[WARNING] 
[WARNING] For this reason, future Maven versions might no longer support building such malformed
projects.
[WARNING] 
[INFO]                                                                         
[INFO] ------------------------------------------------------------------------
[INFO] Building Sample In-Place Integration Test 0.0.1-SNAPSHOT
[INFO] ------------------------------------------------------------------------
[INFO] Downloading: https://repo.maven.apache.org/maven2/org/apache/maven/plugins/maven-war-plugin/maven-metadata.xml
[INFO] Downloaded: https://repo.maven.apache.org/maven2/org/apache/maven/plugins/maven-war-plugin/maven-metadata.xml
(825 B at 35.0 KB/sec)
[INFO] Downloading: https://repo.maven.apache.org/maven2/org/apache/maven/plugins/maven-compiler-plugin/maven-metadata.xml
[INFO] Downloaded: https://repo.maven.apache.org/maven2/org/apache/maven/plugins/maven-compiler-plugin/maven-metadata.xml
(862 B at 4.4 KB/sec)
[INFO] Downloading: https://repo.maven.apache.org/maven2/org/apache/maven/plugins/maven-install-plugin/maven-metadata.xml
[INFO] Downloaded: https://repo.maven.apache.org/maven2/org/apache/maven/plugins/maven-install-plugin/maven-metadata.xml
(623 B at 11.3 KB/sec)
[INFO] Downloading: https://repo.maven.apache.org/maven2/org/apache/maven/plugins/maven-resources-plugin/maven-metadata.xml
[INFO] Downloaded: https://repo.maven.apache.org/maven2/org/apache/maven/plugins/maven-resources-plugin/maven-metadata.xml
(781 B at 8.9 KB/sec)
[INFO] Downloading: https://repo.maven.apache.org/maven2/org/apache/maven/plugins/maven-surefire-plugin/maven-metadata.xml
[INFO] Downloaded: https://repo.maven.apache.org/maven2/org/apache/maven/plugins/maven-surefire-plugin/maven-metadata.xml
(2 KB at 20.7 KB/sec)
[INFO] Downloading: https://repo.maven.apache.org/maven2/org/apache/maven/plugins/maven-deploy-plugin/maven-metadata.xml
[INFO] Downloaded: https://repo.maven.apache.org/maven2/org/apache/maven/plugins/maven-deploy-plugin/maven-metadata.xml
(709 B at 12.6 KB/sec)
[INFO] Downloading: https://repo.maven.apache.org/maven2/org/apache/felix/maven-scr-plugin/1.4.0/maven-scr-plugin-1.4.0.pom
[INFO] Downloaded: https://repo.maven.apache.org/maven2/org/apache/felix/maven-scr-plugin/1.4.0/maven-scr-plugin-1.4.0.pom
(4 KB at 109.4 KB/sec)
[INFO] Downloading: https://repo.maven.apache.org/maven2/org/apache/felix/maven-scr-plugin/1.4.0/maven-scr-plugin-1.4.0.jar
[INFO] Downloaded: https://repo.maven.apache.org/maven2/org/apache/felix/maven-scr-plugin/1.4.0/maven-scr-plugin-1.4.0.jar
(122 KB at 1149.8 KB/sec)
[INFO] Downloading: https://repo.maven.apache.org/maven2/org/apache/maven/plugins/maven-failsafe-plugin/2.5/maven-failsafe-plugin-2.5.pom
[INFO] Downloaded: https://repo.maven.apache.org/maven2/org/apache/maven/plugins/maven-failsafe-plugin/2.5/maven-failsafe-plugin-2.5.pom
(10 KB at 146.6 KB/sec)
[INFO] Downloading: https://repo.maven.apache.org/maven2/org/apache/maven/plugins/maven-failsafe-plugin/2.5/maven-failsafe-plugin-2.5.jar
[INFO] Downloaded: https://repo.maven.apache.org/maven2/org/apache/maven/plugins/maven-failsafe-plugin/2.5/maven-failsafe-plugin-2.5.jar
(47 KB at 789.8 KB/sec)
[INFO] Downloading: https://repo.maven.apache.org/maven2/org/codehaus/cargo/cargo-maven2-plugin/1.0/cargo-maven2-plugin-1.0.pom
[INFO] Downloaded: https://repo.maven.apache.org/maven2/org/codehaus/cargo/cargo-maven2-plugin/1.0/cargo-maven2-plugin-1.0.pom
(7 KB at 64.2 KB/sec)
[INFO] Downloading: https://repo.maven.apache.org/maven2/org/codehaus/cargo/cargo-extensions-maven2/1.0/cargo-extensions-maven2-1.0.pom
[INFO] Downloaded: https://repo.maven.apache.org/maven2/org/codehaus/cargo/cargo-extensions-maven2/1.0/cargo-extensions-maven2-1.0.pom
(2 KB at 37.3 KB/sec)
[INFO] Downloading: https://repo.maven.apache.org/maven2/org/codehaus/cargo/cargo-extensions/1.0/cargo-extensions-1.0.pom
[INFO] Downloaded: https://repo.maven.apache.org/maven2/org/codehaus/cargo/cargo-extensions/1.0/cargo-extensions-1.0.pom
(5 KB at 124.9 KB/sec)
[INFO] Downloading: https://repo.maven.apache.org/maven2/org/codehaus/cargo/cargo-parent/4.1/cargo-parent-4.1.pom
[INFO] Downloaded: https://repo.maven.apache.org/maven2/org/codehaus/cargo/cargo-parent/4.1/cargo-parent-4.1.pom
(11 KB at 108.0 KB/sec)
[INFO] Downloading: https://repo.maven.apache.org/maven2/org/codehaus/cargo/cargo-maven2-plugin/1.0/cargo-maven2-plugin-1.0.jar
[INFO] Downloaded: https://repo.maven.apache.org/maven2/org/codehaus/cargo/cargo-maven2-plugin/1.0/cargo-maven2-plugin-1.0.jar
(78 KB at 727.7 KB/sec)
[INFO] Downloading: https://repo.maven.apache.org/maven2/org/apache/felix/org.apache.felix.scr.annotations/1.0.0/org.apache.felix.scr.annotations-1.0.0.pom
[INFO] Downloaded: https://repo.maven.apache.org/maven2/org/apache/felix/org.apache.felix.scr.annotations/1.0.0/org.apache.felix.scr.annotations-1.0.0.pom
(3 KB at 42.9 KB/sec)
[INFO] Downloading: https://repo.maven.apache.org/maven2/org/apache/felix/org.apache.felix.scr.annotations/1.0.0/org.apache.felix.scr.annotations-1.0.0.jar
[INFO] Downloaded: https://repo.maven.apache.org/maven2/org/apache/felix/org.apache.felix.scr.annotations/1.0.0/org.apache.felix.scr.annotations-1.0.0.jar
(17 KB at 59.6 KB/sec)
[INFO] 
[INFO] --- maven-clean-plugin:2.5:clean (default-clean) @ inplace-integration-test ---
[INFO] 
[INFO] --- maven-resources-plugin:3.0.1:resources (default-resources) @ inplace-integration-test
---
[WARNING] Using platform encoding (ISO-8859-1 actually) to copy filtered resources, i.e. build
is platform dependent!
[INFO] skip non existing resourceDirectory <https://builds.apache.org/job/sling-samples-inplace-integration-test-1.7/ws/src/main/resources>
[INFO] 
[INFO] --- build-helper-maven-plugin:1.5:reserve-network-port (reserve-network-port) @ inplace-integration-test
---
[INFO] Reserved port 50925 for http.port
[INFO] 
[INFO] --- maven-compiler-plugin:3.5.1:compile (default-compile) @ inplace-integration-test
---
[INFO] Changes detected - recompiling the module!
[WARNING] File encoding has not been set, using platform encoding ISO-8859-1, i.e. build is
platform dependent!
[INFO] Compiling 1 source file to <https://builds.apache.org/job/sling-samples-inplace-integration-test-1.7/ws/target/classes>
[INFO] 
[INFO] --- maven-scr-plugin:1.4.0:scr (generate-scr-descriptor) @ inplace-integration-test
---
[INFO] Downloading: https://repo.maven.apache.org/maven2/com/thoughtworks/qdox/qdox/1.9.1/qdox-1.9.1.pom
[INFO] Downloaded: https://repo.maven.apache.org/maven2/com/thoughtworks/qdox/qdox/1.9.1/qdox-1.9.1.pom
(13 KB at 36.9 KB/sec)
[INFO] Downloading: https://repo.maven.apache.org/maven2/org/slf4j/slf4j-api/1.4.3/slf4j-api-1.4.3.pom
[INFO] Downloaded: https://repo.maven.apache.org/maven2/org/slf4j/slf4j-api/1.4.3/slf4j-api-1.4.3.pom
(3 KB at 32.8 KB/sec)
[INFO] Downloading: https://repo.maven.apache.org/maven2/org/slf4j/slf4j-parent/1.4.3/slf4j-parent-1.4.3.pom
[INFO] Downloaded: https://repo.maven.apache.org/maven2/org/slf4j/slf4j-parent/1.4.3/slf4j-parent-1.4.3.pom
(8 KB at 203.0 KB/sec)
[INFO] Downloading: https://repo.maven.apache.org/maven2/org/slf4j/slf4j-simple/1.4.3/slf4j-simple-1.4.3.pom
[INFO] Downloaded: https://repo.maven.apache.org/maven2/org/slf4j/slf4j-simple/1.4.3/slf4j-simple-1.4.3.pom
(2 KB at 9.3 KB/sec)
[INFO] Downloading: https://repo.maven.apache.org/maven2/com/thoughtworks/qdox/qdox/1.9.1/qdox-1.9.1.jar
[INFO] Downloading: https://repo.maven.apache.org/maven2/org/slf4j/slf4j-api/1.4.3/slf4j-api-1.4.3.jar
[INFO] Downloading: https://repo.maven.apache.org/maven2/org/slf4j/slf4j-simple/1.4.3/slf4j-simple-1.4.3.jar
[INFO] Downloaded: https://repo.maven.apache.org/maven2/org/slf4j/slf4j-simple/1.4.3/slf4j-simple-1.4.3.jar
(8 KB at 72.7 KB/sec)
[INFO] Downloaded: https://repo.maven.apache.org/maven2/org/slf4j/slf4j-api/1.4.3/slf4j-api-1.4.3.jar
(15 KB at 122.8 KB/sec)
[INFO] Downloaded: https://repo.maven.apache.org/maven2/com/thoughtworks/qdox/qdox/1.9.1/qdox-1.9.1.jar
(164 KB at 503.1 KB/sec)
[INFO] Writing abstract service descriptor <https://builds.apache.org/job/sling-samples-inplace-integration-test-1.7/ws/target/scr-plugin-generated/OSGI-INF/scr-plugin/scrinfo.xml>
with 1 entries.
[INFO] Generating 1 Service Component Descriptors to <https://builds.apache.org/job/sling-samples-inplace-integration-test-1.7/ws/target/scr-plugin-generated/OSGI-INF/serviceComponents.xml>
[INFO] 
[INFO] --- maven-resources-plugin:3.0.1:testResources (default-testResources) @ inplace-integration-test
---
[WARNING] Using platform encoding (ISO-8859-1 actually) to copy filtered resources, i.e. build
is platform dependent!
[INFO] skip non existing resourceDirectory <https://builds.apache.org/job/sling-samples-inplace-integration-test-1.7/ws/src/test/resources>
[INFO] 
[INFO] --- maven-compiler-plugin:3.5.1:testCompile (default-testCompile) @ inplace-integration-test
---
[INFO] Changes detected - recompiling the module!
[WARNING] File encoding has not been set, using platform encoding ISO-8859-1, i.e. build is
platform dependent!
[INFO] Compiling 2 source files to <https://builds.apache.org/job/sling-samples-inplace-integration-test-1.7/ws/target/test-classes>
[INFO] 
[INFO] --- maven-surefire-plugin:2.19.1:test (default-test) @ inplace-integration-test ---
[JENKINS] Recording test results[INFO] 
[INFO] --- maven-bundle-plugin:2.0.1:bundle (default-bundle) @ inplace-integration-test ---

[INFO] 
[INFO] --- maven-launchpad-plugin:2.1.2:prepare-test-webapp (prepare-test-webapp) @ inplace-integration-test
---
[JENKINS] Archiving disabled
[JENKINS] Archiving disabled[INFO] ------------------------------------------------------------------------
[INFO] BUILD FAILURE
[INFO] ------------------------------------------------------------------------
[INFO] Total time: 24.383 s
[INFO] Finished at: 2016-10-11T15:03:20+00:00

[INFO] Final Memory: 30M/314M
[INFO] ------------------------------------------------------------------------
Waiting for Jenkins to finish collecting data
[ERROR] Failed to execute goal org.apache.sling:maven-launchpad-plugin:2.1.2:prepare-test-webapp
(prepare-test-webapp) on project inplace-integration-test: Unable to find artifact. Could
not find artifact org.apache.sling:org.apache.sling.launchpad:xml:bundlelist:7-SNAPSHOT
[ERROR] 
[ERROR] Try downloading the file manually from the project website.
[ERROR] 
[ERROR] Then, install it using the command:
[ERROR] mvn install:install-file -DgroupId=org.apache.sling -DartifactId=org.apache.sling.launchpad
-Dversion=7-SNAPSHOT -Dclassifier=bundlelist -Dpackaging=xml -Dfile=/path/to/file
[ERROR] 
[ERROR] Alternatively, if you host your own repository you can deploy the file there:
[ERROR] mvn deploy:deploy-file -DgroupId=org.apache.sling -DartifactId=org.apache.sling.launchpad
-Dversion=7-SNAPSHOT -Dclassifier=bundlelist -Dpackaging=xml -Dfile=/path/to/file -Durl=[url]
-DrepositoryId=[id]
[ERROR] 
[ERROR] 
[ERROR] org.apache.sling:org.apache.sling.launchpad:xml:7-SNAPSHOT
[ERROR] 
[ERROR] from the specified remote repositories:
[ERROR] central (https://repo.maven.apache.org/maven2, releases=true, snapshots=false)
[ERROR] -> [Help 1]
[ERROR] 
[ERROR] To see the full stack trace of the errors, re-run Maven with the -e switch.
[ERROR] Re-run Maven using the -X switch to enable full debug logging.
[ERROR] 
[ERROR] For more information about the errors and possible solutions, please read the following
articles:
[ERROR] [Help 1] http://cwiki.apache.org/confluence/display/MAVEN/MojoExecutionException
channel stopped
Recording test results

Mime
View raw message