sling-commits mailing list archives

Site index · List index
Message view « Date » · « Thread »
Top « Date » · « Thread »
From Apache Jenkins Server <jenk...@builds.apache.org>
Subject Build failed in Jenkins: sling-karaf-org.apache.sling.karaf-distribution-1.7 #6
Date Thu, 27 Oct 2016 09:08:46 GMT
See <https://builds.apache.org/job/sling-karaf-org.apache.sling.karaf-distribution-1.7/6/>

------------------------------------------
Started by upstream project "sling-karaf-org.apache.sling.karaf-features-1.7" build number
4
originally caused by:
 Started by an SCM change
[EnvInject] - Loading node environment variables.
Building remotely on jenkins-test-c5c (Ubuntu ubuntu jenkins-cloud-8GB jenkins-cloud-4GB cloud-slave)
in workspace <https://builds.apache.org/job/sling-karaf-org.apache.sling.karaf-distribution-1.7/ws/>
Updating https://svn.apache.org/repos/asf/sling/trunk/karaf/org.apache.sling.karaf-distribution
at revision '2016-10-27T09:07:47.154 +0000'
At revision 1766791

No changes for https://svn.apache.org/repos/asf/sling/trunk/karaf/org.apache.sling.karaf-distribution
since the previous build
Parsing POMs
Established TCP socket on 39401
maven32-agent.jar already up to date
maven32-interceptor.jar already up to date
maven3-interceptor-commons.jar already up to date
[sling-karaf-org.apache.sling.karaf-distribution-1.7] $ /home/jenkins/tools/java/latest1.7/bin/java
-Xmx2g -Xms256m -XX:MaxPermSize=512m -cp /home/jenkins/jenkins-slave/maven32-agent.jar:/home/jenkins/tools/maven/apache-maven-3.3.9/boot/plexus-classworlds-2.5.2.jar:/home/jenkins/tools/maven/apache-maven-3.3.9/conf/logging
jenkins.maven3.agent.Maven32Main /home/jenkins/tools/maven/apache-maven-3.3.9 /home/jenkins/jenkins-slave/slave.jar
/home/jenkins/jenkins-slave/maven32-interceptor.jar /home/jenkins/jenkins-slave/maven3-interceptor-commons.jar
39401
<===[JENKINS REMOTING CAPACITY]===>   channel started
Executing Maven:  -B -f <https://builds.apache.org/job/sling-karaf-org.apache.sling.karaf-distribution-1.7/ws/pom.xml>
-Dmaven.repo.local=/home/jenkins/jenkins-slave/maven-repositories/0 -U clean deploy
[INFO] Scanning for projects...
[INFO]                                                                         
[INFO] ------------------------------------------------------------------------
[INFO] Building Apache Sling - Karaf Distribution 0.1.1-SNAPSHOT
[INFO] ------------------------------------------------------------------------
[INFO] Downloading: http://repository.apache.org/snapshots/org/apache/sling/org.apache.sling.karaf-features/0.1.1-SNAPSHOT/maven-metadata.xml
[INFO] Downloaded: http://repository.apache.org/snapshots/org/apache/sling/org.apache.sling.karaf-features/0.1.1-SNAPSHOT/maven-metadata.xml
(2 KB at 6.7 KB/sec)
[INFO] Downloading: http://repository.apache.org/snapshots/org/apache/sling/org.apache.sling.karaf-configs/0.1.1-SNAPSHOT/maven-metadata.xml
[INFO] Downloaded: http://repository.apache.org/snapshots/org/apache/sling/org.apache.sling.karaf-configs/0.1.1-SNAPSHOT/maven-metadata.xml
(8 KB at 185.8 KB/sec)
[INFO] Downloading: http://repository.apache.org/snapshots/org/apache/sling/org.apache.sling.karaf-configs/0.1.1-SNAPSHOT/org.apache.sling.karaf-configs-0.1.1-SNAPSHOT-org.apache.sling.jcr.base.internal.LoginAdminWhitelistImpl.config
[INFO] Downloading: http://repository.apache.org/snapshots/org/apache/sling/org.apache.sling.karaf-configs/0.1.1-SNAPSHOT/org.apache.sling.karaf-configs-0.1.1-SNAPSHOT-org.apache.sling.jcr.repoinit.impl.RepositoryInitializer.config
[JENKINS] Archiving disabled
[JENKINS] Archiving disabled
[INFO] ------------------------------------------------------------------------
[INFO] BUILD FAILURE
[INFO] ------------------------------------------------------------------------
[INFO] Total time: 17.058 s
[INFO] Finished at: 2016-10-27T09:08:48+00:00
[INFO] Final Memory: 22M/310M
[INFO] ------------------------------------------------------------------------
Waiting for Jenkins to finish collecting data[ERROR] Failed to execute goal on project org.apache.sling.karaf-distribution:
Could not resolve dependencies for project org.apache.sling:org.apache.sling.karaf-distribution:karaf-assembly:0.1.1-SNAPSHOT:
The following artifacts could not be resolved: org.apache.sling:org.apache.sling.karaf-configs:config:org.apache.sling.jcr.base.internal.LoginAdminWhitelistImpl:0.1.1-SNAPSHOT,
org.apache.sling:org.apache.sling.karaf-configs:config:org.apache.sling.jcr.repoinit.impl.RepositoryInitializer:0.1.1-SNAPSHOT:
Could not find artifact org.apache.sling:org.apache.sling.karaf-configs:config:org.apache.sling.jcr.base.internal.LoginAdminWhitelistImpl:0.1.1-SNAPSHOT
in Nexus (http://repository.apache.org/snapshots) -> [Help 1]
[ERROR] 

[ERROR] To see the full stack trace of the errors, re-run Maven with the -e switch.
[ERROR] Re-run Maven using the -X switch to enable full debug logging.
[ERROR] 
[ERROR] For more information about the errors and possible solutions, please read the following
articles:
[ERROR] [Help 1] http://cwiki.apache.org/confluence/display/MAVEN/DependencyResolutionException
channel stopped
Recording test results

Mime
View raw message