sling-commits mailing list archives

Site index · List index
Message view « Date » · « Thread »
Top « Date » · « Thread »
From Apache Jenkins Server <jenk...@builds.apache.org>
Subject Build failed in Jenkins: sling-contrib-extensions-cache-infinispan-1.7 #1
Date Tue, 11 Oct 2016 19:45:38 GMT
See <https://builds.apache.org/job/sling-contrib-extensions-cache-infinispan-1.7/1/>

------------------------------------------
[...truncated 18 lines...]
AU        src/main/java/org/apache/sling/commons/cache/infinispan/CacheImpl.java
A         src/main/resources
A         src/main/resources/org
A         src/main/resources/org/apache
A         src/main/resources/org/apache/sling
A         src/main/resources/org/apache/sling/commons
A         src/main/resources/org/apache/sling/commons/cache
A         src/main/resources/org/apache/sling/commons/cache/infinispan
AU        src/main/resources/org/apache/sling/commons/cache/infinispan/config.xml
A         src/test
A         src/test/java
A         src/test/java/org
A         src/test/java/org/apache
A         src/test/java/org/apache/sling
A         src/test/java/org/apache/sling/commons
A         src/test/java/org/apache/sling/commons/cache
A         src/test/java/org/apache/sling/commons/cache/infinispan
AU        src/test/java/org/apache/sling/commons/cache/infinispan/MapBuilder.java
AU        src/test/java/org/apache/sling/commons/cache/infinispan/CacheConfigTest.java
AU        src/test/java/org/apache/sling/commons/cache/infinispan/CacheIT.java
AU        src/test/java/org/apache/sling/commons/cache/infinispan/TestCache.java
 U        .
At revision 1764329

Parsing POMs
Discovered a new module org.apache.sling:org.apache.sling.commons.cache.infinispan Apache
Sling Cache API Infinispan Implementation
Modules changed, recalculating dependency graph
Established TCP socket on 56876
maven32-agent.jar already up to date
maven32-interceptor.jar already up to date
maven3-interceptor-commons.jar already up to date
[sling-contrib-extensions-cache-infinispan-1.7] $ /home/jenkins/tools/java/latest1.7/bin/java
-Xmx2g -Xms256m -XX:MaxPermSize=512m -cp /home/jenkins/jenkins-slave/maven32-agent.jar:/home/jenkins/tools/maven/apache-maven-3.3.9/boot/plexus-classworlds-2.5.2.jar:/home/jenkins/tools/maven/apache-maven-3.3.9/conf/logging
jenkins.maven3.agent.Maven32Main /home/jenkins/tools/maven/apache-maven-3.3.9 /home/jenkins/jenkins-slave/slave.jar
/home/jenkins/jenkins-slave/maven32-interceptor.jar /home/jenkins/jenkins-slave/maven3-interceptor-commons.jar
56876
<===[JENKINS REMOTING CAPACITY]===>   channel started
Executing Maven:  -B -f <https://builds.apache.org/job/sling-contrib-extensions-cache-infinispan-1.7/ws/pom.xml>
-Dmaven.repo.local=/home/jenkins/jenkins-slave/maven-repositories/1 -U clean deploy
[INFO] Scanning for projects...
[INFO] Downloading: https://repo.maven.apache.org/maven2/org/apache/felix/maven-bundle-plugin/2.3.6/maven-bundle-plugin-2.3.6.pom
[INFO] Downloaded: https://repo.maven.apache.org/maven2/org/apache/felix/maven-bundle-plugin/2.3.6/maven-bundle-plugin-2.3.6.pom
(4 KB at 6.5 KB/sec)
[INFO] Downloading: https://repo.maven.apache.org/maven2/org/apache/felix/maven-bundle-plugin/2.3.6/maven-bundle-plugin-2.3.6.jar
[INFO] Downloaded: https://repo.maven.apache.org/maven2/org/apache/felix/maven-bundle-plugin/2.3.6/maven-bundle-plugin-2.3.6.jar
(122 KB at 754.5 KB/sec)
[INFO]                                                                         
[INFO] ------------------------------------------------------------------------
[INFO] Building Apache Sling Cache API Infinispan Implementation 0.1-SNAPSHOT
[INFO] ------------------------------------------------------------------------
[INFO] Downloading: https://repo.maven.apache.org/maven2/org/apache/maven/plugins/maven-failsafe-plugin/2.12/maven-failsafe-plugin-2.12.pom
[INFO] Downloaded: https://repo.maven.apache.org/maven2/org/apache/maven/plugins/maven-failsafe-plugin/2.12/maven-failsafe-plugin-2.12.pom
(13 KB at 129.7 KB/sec)
[INFO] Downloading: https://repo.maven.apache.org/maven2/org/apache/maven/plugins/maven-failsafe-plugin/2.12/maven-failsafe-plugin-2.12.jar
[INFO] Downloaded: https://repo.maven.apache.org/maven2/org/apache/maven/plugins/maven-failsafe-plugin/2.12/maven-failsafe-plugin-2.12.jar
(50 KB at 654.0 KB/sec)
[INFO] Downloading: https://repo.maven.apache.org/maven2/org/codehaus/mojo/animal-sniffer-maven-plugin/1.9/animal-sniffer-maven-plugin-1.9.jar
[INFO] Downloaded: https://repo.maven.apache.org/maven2/org/codehaus/mojo/animal-sniffer-maven-plugin/1.9/animal-sniffer-maven-plugin-1.9.jar
(26 KB at 292.9 KB/sec)
[INFO] Downloading: http://repository.apache.org/snapshots/org/apache/sling/org.apache.sling.commons.cache.api/0.1-SNAPSHOT/maven-metadata.xml
[INFO] Downloading: http://repository.apache.org/snapshots/org/apache/sling/org.apache.sling.commons.cache.api/0.1-SNAPSHOT/org.apache.sling.commons.cache.api-0.1-SNAPSHOT.pom
[WARNING] The POM for org.apache.sling:org.apache.sling.commons.cache.api:jar:0.1-SNAPSHOT
is missing, no dependency information available
[INFO] Downloading: http://repository.apache.org/snapshots/org/apache/sling/org.apache.sling.commons.cache.impl/0.1-SNAPSHOT/maven-metadata.xml
[INFO] Downloading: http://repository.apache.org/snapshots/org/apache/sling/org.apache.sling.commons.cache.impl/0.1-SNAPSHOT/org.apache.sling.commons.cache.impl-0.1-SNAPSHOT.pom
[WARNING] The POM for org.apache.sling:org.apache.sling.commons.cache.impl:jar:0.1-SNAPSHOT
is missing, no dependency information available
[INFO] Downloading: https://repo.maven.apache.org/maven2/org/infinispan/infinispan-core/5.1.8.Final/infinispan-core-5.1.8.Final.pom
[INFO] Downloaded: https://repo.maven.apache.org/maven2/org/infinispan/infinispan-core/5.1.8.Final/infinispan-core-5.1.8.Final.pom
(10 KB at 39.7 KB/sec)
[INFO] Downloading: https://repo.maven.apache.org/maven2/org/infinispan/infinispan-parent/5.1.8.Final/infinispan-parent-5.1.8.Final.pom
[INFO] Downloaded: https://repo.maven.apache.org/maven2/org/infinispan/infinispan-parent/5.1.8.Final/infinispan-parent-5.1.8.Final.pom
(58 KB at 248.2 KB/sec)
[INFO] Downloading: https://repo.maven.apache.org/maven2/org/jboss/arquillian/arquillian-bom/1.0.0.CR5/arquillian-bom-1.0.0.CR5.pom
[INFO] Downloaded: https://repo.maven.apache.org/maven2/org/jboss/arquillian/arquillian-bom/1.0.0.CR5/arquillian-bom-1.0.0.CR5.pom
(10 KB at 114.4 KB/sec)
[INFO] Downloading: https://repo.maven.apache.org/maven2/org/jboss/arquillian/arquillian-parent/1.0.0.CR5/arquillian-parent-1.0.0.CR5.pom
[INFO] Downloaded: https://repo.maven.apache.org/maven2/org/jboss/arquillian/arquillian-parent/1.0.0.CR5/arquillian-parent-1.0.0.CR5.pom
(6 KB at 313.3 KB/sec)
[INFO] Downloading: https://repo.maven.apache.org/maven2/org/jgroups/jgroups/3.0.14.Final/jgroups-3.0.14.Final.pom
[INFO] Downloaded: https://repo.maven.apache.org/maven2/org/jgroups/jgroups/3.0.14.Final/jgroups-3.0.14.Final.pom
(9 KB at 40.3 KB/sec)
[INFO] Downloading: https://repo.maven.apache.org/maven2/org/jboss/marshalling/jboss-marshalling-river/1.3.11.GA/jboss-marshalling-river-1.3.11.GA.pom
[INFO] Downloaded: https://repo.maven.apache.org/maven2/org/jboss/marshalling/jboss-marshalling-river/1.3.11.GA/jboss-marshalling-river-1.3.11.GA.pom
(3 KB at 14.5 KB/sec)
[INFO] Downloading: https://repo.maven.apache.org/maven2/org/jboss/marshalling/jboss-marshalling-parent/1.3.11.GA/jboss-marshalling-parent-1.3.11.GA.pom
[INFO] Downloaded: https://repo.maven.apache.org/maven2/org/jboss/marshalling/jboss-marshalling-parent/1.3.11.GA/jboss-marshalling-parent-1.3.11.GA.pom
(7 KB at 56.3 KB/sec)
[INFO] Downloading: https://repo.maven.apache.org/maven2/org/jboss/marshalling/jboss-marshalling/1.3.11.GA/jboss-marshalling-1.3.11.GA.pom
[INFO] Downloaded: https://repo.maven.apache.org/maven2/org/jboss/marshalling/jboss-marshalling/1.3.11.GA/jboss-marshalling-1.3.11.GA.pom
(4 KB at 111.8 KB/sec)
[INFO] Downloading: https://repo.maven.apache.org/maven2/org/codehaus/woodstox/woodstox-core-asl/4.1.1/woodstox-core-asl-4.1.1.pom
[INFO] Downloaded: https://repo.maven.apache.org/maven2/org/codehaus/woodstox/woodstox-core-asl/4.1.1/woodstox-core-asl-4.1.1.pom
(2 KB at 17.5 KB/sec)
[INFO] Downloading: https://repo.maven.apache.org/maven2/org/rhq/helpers/rhq-pluginAnnotations/3.0.4/rhq-pluginAnnotations-3.0.4.pom
[INFO] Downloaded: https://repo.maven.apache.org/maven2/org/rhq/helpers/rhq-pluginAnnotations/3.0.4/rhq-pluginAnnotations-3.0.4.pom
(2 KB at 86.8 KB/sec)
[INFO] Downloading: https://repo.maven.apache.org/maven2/org/rhq/rhq-parent/4.0.1/rhq-parent-4.0.1.pom
[INFO] Downloaded: https://repo.maven.apache.org/maven2/org/rhq/rhq-parent/4.0.1/rhq-parent-4.0.1.pom
(47 KB at 771.5 KB/sec)
[INFO] Downloading: http://repository.apache.org/snapshots/org/apache/sling/org.apache.sling.commons.cache.container-test/0.1-SNAPSHOT/maven-metadata.xml
[INFO] Downloaded: http://repository.apache.org/snapshots/org/apache/sling/org.apache.sling.commons.cache.container-test/0.1-SNAPSHOT/maven-metadata.xml
(1017 B at 2.7 KB/sec)
[INFO] Downloading: http://repository.apache.org/snapshots/org/apache/sling/org.apache.sling.commons.cache.container-test/0.1-SNAPSHOT/org.apache.sling.commons.cache.container-test-0.1-20161011.193716-1.pom
[INFO] Downloaded: http://repository.apache.org/snapshots/org/apache/sling/org.apache.sling.commons.cache.container-test/0.1-SNAPSHOT/org.apache.sling.commons.cache.container-test-0.1-20161011.193716-1.pom
(5 KB at 11.7 KB/sec)
[INFO] Downloading: https://repo.maven.apache.org/maven2/org/ops4j/pax/exam/pax-exam-container-forked/2.4.0.RC1/pax-exam-container-forked-2.4.0.RC1.pom
[INFO] Downloaded: https://repo.maven.apache.org/maven2/org/ops4j/pax/exam/pax-exam-container-forked/2.4.0.RC1/pax-exam-container-forked-2.4.0.RC1.pom
(6 KB at 140.4 KB/sec)
[INFO] Downloading: https://repo.maven.apache.org/maven2/org/ops4j/pax/exam/2.4.0.RC1/exam-2.4.0.RC1.pom
[INFO] Downloaded: https://repo.maven.apache.org/maven2/org/ops4j/pax/exam/2.4.0.RC1/exam-2.4.0.RC1.pom
(15 KB at 131.1 KB/sec)
[INFO] Downloading: https://repo.maven.apache.org/maven2/org/ops4j/pax/exam-reactor/2.4.0.RC1/exam-reactor-2.4.0.RC1.pom
[INFO] Downloaded: https://repo.maven.apache.org/maven2/org/ops4j/pax/exam-reactor/2.4.0.RC1/exam-reactor-2.4.0.RC1.pom
(5 KB at 91.8 KB/sec)
[INFO] Downloading: https://repo.maven.apache.org/maven2/org/ops4j/master/2.0.0/master-2.0.0.pom
[INFO] Downloaded: https://repo.maven.apache.org/maven2/org/ops4j/master/2.0.0/master-2.0.0.pom
(12 KB at 255.4 KB/sec)
[INFO] Downloading: https://repo.maven.apache.org/maven2/org/ops4j/pax/exam/pax-exam/2.4.0.RC1/pax-exam-2.4.0.RC1.pom
[INFO] Downloaded: https://repo.maven.apache.org/maven2/org/ops4j/pax/exam/pax-exam/2.4.0.RC1/pax-exam-2.4.0.RC1.pom
(3 KB at 44.0 KB/sec)
[INFO] Downloading: https://repo.maven.apache.org/maven2/org/ops4j/base/ops4j-base-lang/1.3.0/ops4j-base-lang-1.3.0.pom
[INFO] Downloaded: https://repo.maven.apache.org/maven2/org/ops4j/base/ops4j-base-lang/1.3.0/ops4j-base-lang-1.3.0.pom
(988 B at 8.9 KB/sec)
[INFO] Downloading: https://repo.maven.apache.org/maven2/org/ops4j/base/1.3.0/base-1.3.0.pom
[INFO] Downloaded: https://repo.maven.apache.org/maven2/org/ops4j/base/1.3.0/base-1.3.0.pom
(7 KB at 59.7 KB/sec)
[INFO] Downloading: https://repo.maven.apache.org/maven2/org/ops4j/base/ops4j-base-store/1.3.0/ops4j-base-store-1.3.0.pom
[INFO] Downloaded: https://repo.maven.apache.org/maven2/org/ops4j/base/ops4j-base-store/1.3.0/ops4j-base-store-1.3.0.pom
(2 KB at 22.9 KB/sec)
[INFO] Downloading: https://repo.maven.apache.org/maven2/org/ops4j/base/ops4j-base-io/1.3.0/ops4j-base-io-1.3.0.pom
[INFO] Downloaded: https://repo.maven.apache.org/maven2/org/ops4j/base/ops4j-base-io/1.3.0/ops4j-base-io-1.3.0.pom
(2 KB at 30.0 KB/sec)
[INFO] Downloading: https://repo.maven.apache.org/maven2/org/ops4j/base/ops4j-base-monitors/1.3.0/ops4j-base-monitors-1.3.0.pom
[INFO] Downloaded: https://repo.maven.apache.org/maven2/org/ops4j/base/ops4j-base-monitors/1.3.0/ops4j-base-monitors-1.3.0.pom
(1005 B at 9.7 KB/sec)
[INFO] Downloading: https://repo.maven.apache.org/maven2/org/ops4j/base/ops4j-base-util-property/1.3.0/ops4j-base-util-property-1.3.0.pom
[INFO] Downloaded: https://repo.maven.apache.org/maven2/org/ops4j/base/ops4j-base-util-property/1.3.0/ops4j-base-util-property-1.3.0.pom
(2 KB at 10.2 KB/sec)
[INFO] Downloading: https://repo.maven.apache.org/maven2/org/ops4j/pax/exam/pax-exam-spi/2.4.0.RC1/pax-exam-spi-2.4.0.RC1.pom
[INFO] Downloaded: https://repo.maven.apache.org/maven2/org/ops4j/pax/exam/pax-exam-spi/2.4.0.RC1/pax-exam-spi-2.4.0.RC1.pom
(3 KB at 73.1 KB/sec)
[INFO] Downloading: https://repo.maven.apache.org/maven2/org/ops4j/pax/url/pax-url-link/1.4.0.RC1/pax-url-link-1.4.0.RC1.pom
[INFO] Downloaded: https://repo.maven.apache.org/maven2/org/ops4j/pax/url/pax-url-link/1.4.0.RC1/pax-url-link-1.4.0.RC1.pom
(3 KB at 64.1 KB/sec)
[INFO] Downloading: https://repo.maven.apache.org/maven2/org/ops4j/pax/url/1.4.0.RC1/url-1.4.0.RC1.pom
[INFO] Downloaded: https://repo.maven.apache.org/maven2/org/ops4j/pax/url/1.4.0.RC1/url-1.4.0.RC1.pom
(8 KB at 349.7 KB/sec)
[INFO] Downloading: https://repo.maven.apache.org/maven2/org/ops4j/pax/url/pax-url-commons/1.4.0.RC1/pax-url-commons-1.4.0.RC1.pom
[INFO] Downloaded: https://repo.maven.apache.org/maven2/org/ops4j/pax/url/pax-url-commons/1.4.0.RC1/pax-url-commons-1.4.0.RC1.pom
(3 KB at 21.2 KB/sec)
[INFO] Downloading: https://repo.maven.apache.org/maven2/org/ops4j/pax/swissbox/pax-swissbox-property/1.5.0/pax-swissbox-property-1.5.0.pom
[INFO] Downloaded: https://repo.maven.apache.org/maven2/org/ops4j/pax/swissbox/pax-swissbox-property/1.5.0/pax-swissbox-property-1.5.0.pom
(2 KB at 16.1 KB/sec)
[INFO] Downloading: https://repo.maven.apache.org/maven2/org/ops4j/pax/swissbox/1.5.0/swissbox-1.5.0.pom
[INFO] Downloaded: https://repo.maven.apache.org/maven2/org/ops4j/pax/swissbox/1.5.0/swissbox-1.5.0.pom
(9 KB at 71.7 KB/sec)
[INFO] Downloading: https://repo.maven.apache.org/maven2/org/ops4j/pax/url/pax-url-classpath/1.4.0.RC1/pax-url-classpath-1.4.0.RC1.pom
[INFO] Downloaded: https://repo.maven.apache.org/maven2/org/ops4j/pax/url/pax-url-classpath/1.4.0.RC1/pax-url-classpath-1.4.0.RC1.pom
(3 KB at 59.4 KB/sec)
[INFO] Downloading: https://repo.maven.apache.org/maven2/org/ops4j/pax/swissbox/pax-swissbox-optional-jcl/1.5.0/pax-swissbox-optional-jcl-1.5.0.pom
[INFO] Downloaded: https://repo.maven.apache.org/maven2/org/ops4j/pax/swissbox/pax-swissbox-optional-jcl/1.5.0/pax-swissbox-optional-jcl-1.5.0.pom
(2 KB at 7.1 KB/sec)
[INFO] Downloading: https://repo.maven.apache.org/maven2/org/ops4j/base/ops4j-base-exec/1.3.0/ops4j-base-exec-1.3.0.pom
[INFO] Downloaded: https://repo.maven.apache.org/maven2/org/ops4j/base/ops4j-base-exec/1.3.0/ops4j-base-exec-1.3.0.pom
(2 KB at 43.1 KB/sec)
[INFO] Downloading: https://repo.maven.apache.org/maven2/org/ops4j/base/ops4j-base-net/1.3.0/ops4j-base-net-1.3.0.pom
[INFO] Downloaded: https://repo.maven.apache.org/maven2/org/ops4j/base/ops4j-base-net/1.3.0/ops4j-base-net-1.3.0.pom
(2 KB at 18.4 KB/sec)
[INFO] Downloading: https://repo.maven.apache.org/maven2/org/ops4j/base/ops4j-base-spi/1.3.0/ops4j-base-spi-1.3.0.pom
[INFO] Downloaded: https://repo.maven.apache.org/maven2/org/ops4j/base/ops4j-base-spi/1.3.0/ops4j-base-spi-1.3.0.pom
(985 B at 17.5 KB/sec)
[INFO] Downloading: https://repo.maven.apache.org/maven2/org/ops4j/pax/swissbox/pax-swissbox-framework/1.5.0/pax-swissbox-framework-1.5.0.pom
[INFO] Downloaded: https://repo.maven.apache.org/maven2/org/ops4j/pax/swissbox/pax-swissbox-framework/1.5.0/pax-swissbox-framework-1.5.0.pom
(4 KB at 100.6 KB/sec)
[INFO] Downloading: https://repo.maven.apache.org/maven2/org/ops4j/pax/url/pax-url-aether/1.4.0.RC1/pax-url-aether-1.4.0.RC1.pom
[INFO] Downloaded: https://repo.maven.apache.org/maven2/org/ops4j/pax/url/pax-url-aether/1.4.0.RC1/pax-url-aether-1.4.0.RC1.pom
(8 KB at 182.2 KB/sec)
[INFO] Downloading: https://repo.maven.apache.org/maven2/org/ops4j/pax/url/pax-url-maven-commons/1.4.0.RC1/pax-url-maven-commons-1.4.0.RC1.pom
[INFO] Downloaded: https://repo.maven.apache.org/maven2/org/ops4j/pax/url/pax-url-maven-commons/1.4.0.RC1/pax-url-maven-commons-1.4.0.RC1.pom
(2 KB at 44.0 KB/sec)
[INFO] Downloading: https://repo.maven.apache.org/maven2/org/ops4j/base/ops4j-base-util-xml/1.3.0/ops4j-base-util-xml-1.3.0.pom
[INFO] Downloaded: https://repo.maven.apache.org/maven2/org/ops4j/base/ops4j-base-util-xml/1.3.0/ops4j-base-util-xml-1.3.0.pom
(2 KB at 12.4 KB/sec)
[INFO] Downloading: https://repo.maven.apache.org/maven2/org/ops4j/base/ops4j-base-util-collections/1.3.0/ops4j-base-util-collections-1.3.0.pom
[INFO] Downloaded: https://repo.maven.apache.org/maven2/org/ops4j/base/ops4j-base-util-collections/1.3.0/ops4j-base-util-collections-1.3.0.pom
(2 KB at 7.9 KB/sec)
[INFO] Downloading: https://repo.maven.apache.org/maven2/org/sonatype/aether/aether-connector-wagon/1.11/aether-connector-wagon-1.11.pom
[INFO] Downloaded: https://repo.maven.apache.org/maven2/org/sonatype/aether/aether-connector-wagon/1.11/aether-connector-wagon-1.11.pom
(4 KB at 132.6 KB/sec)
[INFO] Downloading: https://repo.maven.apache.org/maven2/org/apache/maven/wagon/wagon-file/1.0-beta-7/wagon-file-1.0-beta-7.pom
[INFO] Downloaded: https://repo.maven.apache.org/maven2/org/apache/maven/wagon/wagon-file/1.0-beta-7/wagon-file-1.0-beta-7.pom
(2 KB at 20.7 KB/sec)
[INFO] Downloading: https://repo.maven.apache.org/maven2/org/apache/maven/wagon/wagon-http-lightweight/1.0-beta-7/wagon-http-lightweight-1.0-beta-7.pom
[INFO] Downloaded: https://repo.maven.apache.org/maven2/org/apache/maven/wagon/wagon-http-lightweight/1.0-beta-7/wagon-http-lightweight-1.0-beta-7.pom
(2 KB at 31.5 KB/sec)
[INFO] Downloading: https://repo.maven.apache.org/maven2/org/apache/maven/wagon/wagon-http-shared/1.0-beta-7/wagon-http-shared-1.0-beta-7.pom
[INFO] Downloaded: https://repo.maven.apache.org/maven2/org/apache/maven/wagon/wagon-http-shared/1.0-beta-7/wagon-http-shared-1.0-beta-7.pom
(3 KB at 42.4 KB/sec)
[INFO] Downloading: https://repo.maven.apache.org/maven2/org/ops4j/pax/exam/pax-exam-junit4/2.4.0.RC1/pax-exam-junit4-2.4.0.RC1.pom
[INFO] Downloaded: https://repo.maven.apache.org/maven2/org/ops4j/pax/exam/pax-exam-junit4/2.4.0.RC1/pax-exam-junit4-2.4.0.RC1.pom
(2 KB at 69.9 KB/sec)
[INFO] Downloading: https://repo.maven.apache.org/maven2/org/ops4j/pax/exam/pax-exam-link-mvn/2.4.0.RC1/pax-exam-link-mvn-2.4.0.RC1.pom
[INFO] Downloaded: https://repo.maven.apache.org/maven2/org/ops4j/pax/exam/pax-exam-link-mvn/2.4.0.RC1/pax-exam-link-mvn-2.4.0.RC1.pom
(808 B at 8.9 KB/sec)
[INFO] Downloading: https://repo.maven.apache.org/maven2/org/ops4j/pax/url/pax-url-wrap/1.4.0.RC1/pax-url-wrap-1.4.0.RC1.pom
[INFO] Downloaded: https://repo.maven.apache.org/maven2/org/ops4j/pax/url/pax-url-wrap/1.4.0.RC1/pax-url-wrap-1.4.0.RC1.pom
(3 KB at 25.2 KB/sec)
[INFO] Downloading: https://repo.maven.apache.org/maven2/org/ops4j/pax/swissbox/pax-swissbox-bnd/1.5.0/pax-swissbox-bnd-1.5.0.pom
[INFO] Downloaded: https://repo.maven.apache.org/maven2/org/ops4j/pax/swissbox/pax-swissbox-bnd/1.5.0/pax-swissbox-bnd-1.5.0.pom
(3 KB at 17.5 KB/sec)
[INFO] Downloading: https://repo.maven.apache.org/maven2/org/ops4j/base/ops4j-base-net/1.2.3/ops4j-base-net-1.2.3.pom
[INFO] Downloaded: https://repo.maven.apache.org/maven2/org/ops4j/base/ops4j-base-net/1.2.3/ops4j-base-net-1.2.3.pom
(2 KB at 6.6 KB/sec)
[INFO] Downloading: https://repo.maven.apache.org/maven2/org/apache/felix/org.apache.felix.framework/4.0.2/org.apache.felix.framework-4.0.2.pom
[INFO] Downloaded: https://repo.maven.apache.org/maven2/org/apache/felix/org.apache.felix.framework/4.0.2/org.apache.felix.framework-4.0.2.pom
(5 KB at 25.3 KB/sec)
[INFO] Downloading: https://repo.maven.apache.org/maven2/org/apache/felix/org.apache.felix.scr/1.8.0/org.apache.felix.scr-1.8.0.pom
[INFO] Downloaded: https://repo.maven.apache.org/maven2/org/apache/felix/org.apache.felix.scr/1.8.0/org.apache.felix.scr-1.8.0.pom
(21 KB at 268.2 KB/sec)
[INFO] Downloading: http://repository.apache.org/snapshots/org/apache/sling/org.apache.sling.commons.cache.api/0.1-SNAPSHOT/org.apache.sling.commons.cache.api-0.1-SNAPSHOT.jar
[INFO] Downloading: http://repository.apache.org/snapshots/org/apache/sling/org.apache.sling.commons.cache.impl/0.1-SNAPSHOT/org.apache.sling.commons.cache.impl-0.1-SNAPSHOT.jar
[INFO] Downloading: http://repository.apache.org/snapshots/org/apache/sling/org.apache.sling.commons.cache.container-test/0.1-SNAPSHOT/org.apache.sling.commons.cache.container-test-0.1-20161011.193716-1.jar
[INFO] Downloaded: http://repository.apache.org/snapshots/org/apache/sling/org.apache.sling.commons.cache.container-test/0.1-SNAPSHOT/org.apache.sling.commons.cache.container-test-0.1-20161011.193716-1.jar
(15 KB at 36.2 KB/sec)
[INFO] Downloading: https://repo.maven.apache.org/maven2/org/infinispan/infinispan-core/5.1.8.Final/infinispan-core-5.1.8.Final.jar
[INFO] Downloading: https://repo.maven.apache.org/maven2/org/jgroups/jgroups/3.0.14.Final/jgroups-3.0.14.Final.jar
[INFO] Downloading: https://repo.maven.apache.org/maven2/org/jboss/marshalling/jboss-marshalling-river/1.3.11.GA/jboss-marshalling-river-1.3.11.GA.jar
[INFO] Downloading: https://repo.maven.apache.org/maven2/org/jboss/marshalling/jboss-marshalling/1.3.11.GA/jboss-marshalling-1.3.11.GA.jar
[INFO] Downloading: https://repo.maven.apache.org/maven2/org/codehaus/woodstox/woodstox-core-asl/4.1.1/woodstox-core-asl-4.1.1.jar
[INFO] Downloaded: https://repo.maven.apache.org/maven2/org/jboss/marshalling/jboss-marshalling-river/1.3.11.GA/jboss-marshalling-river-1.3.11.GA.jar
(81 KB at 770.9 KB/sec)
[INFO] Downloading: https://repo.maven.apache.org/maven2/org/rhq/helpers/rhq-pluginAnnotations/3.0.4/rhq-pluginAnnotations-3.0.4.jar
[INFO] Downloaded: https://repo.maven.apache.org/maven2/org/rhq/helpers/rhq-pluginAnnotations/3.0.4/rhq-pluginAnnotations-3.0.4.jar
(8 KB at 61.5 KB/sec)
[INFO] Downloading: https://repo.maven.apache.org/maven2/org/ops4j/pax/exam/pax-exam-container-forked/2.4.0.RC1/pax-exam-container-forked-2.4.0.RC1.jar
[INFO] Downloaded: https://repo.maven.apache.org/maven2/org/jboss/marshalling/jboss-marshalling/1.3.11.GA/jboss-marshalling-1.3.11.GA.jar
(223 KB at 1258.0 KB/sec)
[INFO] Downloaded: https://repo.maven.apache.org/maven2/org/ops4j/pax/exam/pax-exam-container-forked/2.4.0.RC1/pax-exam-container-forked-2.4.0.RC1.jar
(22 KB at 122.2 KB/sec)
[INFO] Downloading: https://repo.maven.apache.org/maven2/org/ops4j/pax/exam/pax-exam/2.4.0.RC1/pax-exam-2.4.0.RC1.jar
[INFO] Downloading: https://repo.maven.apache.org/maven2/org/ops4j/base/ops4j-base-util-property/1.3.0/ops4j-base-util-property-1.3.0.jar
[INFO] Downloaded: https://repo.maven.apache.org/maven2/org/codehaus/woodstox/woodstox-core-asl/4.1.1/woodstox-core-asl-4.1.1.jar
(468 KB at 2512.0 KB/sec)
[INFO] Downloading: https://repo.maven.apache.org/maven2/org/ops4j/pax/exam/pax-exam-spi/2.4.0.RC1/pax-exam-spi-2.4.0.RC1.jar
[INFO] Downloaded: https://repo.maven.apache.org/maven2/org/ops4j/pax/exam/pax-exam-spi/2.4.0.RC1/pax-exam-spi-2.4.0.RC1.jar
(30 KB at 145.7 KB/sec)
[INFO] Downloading: https://repo.maven.apache.org/maven2/org/ops4j/pax/url/pax-url-link/1.4.0.RC1/pax-url-link-1.4.0.RC1.jar
[INFO] Downloaded: https://repo.maven.apache.org/maven2/org/ops4j/pax/exam/pax-exam/2.4.0.RC1/pax-exam-2.4.0.RC1.jar
(74 KB at 307.0 KB/sec)
[INFO] Downloading: https://repo.maven.apache.org/maven2/org/ops4j/pax/url/pax-url-classpath/1.4.0.RC1/pax-url-classpath-1.4.0.RC1.jar
[INFO] Downloaded: https://repo.maven.apache.org/maven2/org/ops4j/pax/url/pax-url-link/1.4.0.RC1/pax-url-link-1.4.0.RC1.jar
(8 KB at 28.8 KB/sec)
[INFO] Downloading: https://repo.maven.apache.org/maven2/org/ops4j/pax/swissbox/pax-swissbox-optional-jcl/1.5.0/pax-swissbox-optional-jcl-1.5.0.jar
[INFO] Downloaded: https://repo.maven.apache.org/maven2/org/ops4j/pax/url/pax-url-classpath/1.4.0.RC1/pax-url-classpath-1.4.0.RC1.jar
(9 KB at 32.4 KB/sec)
[INFO] Downloading: https://repo.maven.apache.org/maven2/org/ops4j/base/ops4j-base-exec/1.3.0/ops4j-base-exec-1.3.0.jar
[INFO] Downloaded: https://repo.maven.apache.org/maven2/org/ops4j/base/ops4j-base-exec/1.3.0/ops4j-base-exec-1.3.0.jar
(9 KB at 31.2 KB/sec)
[INFO] Downloading: https://repo.maven.apache.org/maven2/org/ops4j/base/ops4j-base-io/1.3.0/ops4j-base-io-1.3.0.jar
[INFO] Downloaded: https://repo.maven.apache.org/maven2/org/ops4j/base/ops4j-base-io/1.3.0/ops4j-base-io-1.3.0.jar
(20 KB at 63.9 KB/sec)
[INFO] Downloading: https://repo.maven.apache.org/maven2/org/ops4j/base/ops4j-base-spi/1.3.0/ops4j-base-spi-1.3.0.jar
[INFO] Downloaded: https://repo.maven.apache.org/maven2/org/ops4j/base/ops4j-base-spi/1.3.0/ops4j-base-spi-1.3.0.jar
(5 KB at 14.9 KB/sec)
[INFO] Downloading: https://repo.maven.apache.org/maven2/org/ops4j/pax/swissbox/pax-swissbox-framework/1.5.0/pax-swissbox-framework-1.5.0.jar
[INFO] Downloaded: https://repo.maven.apache.org/maven2/org/ops4j/base/ops4j-base-util-property/1.3.0/ops4j-base-util-property-1.3.0.jar
(6 KB at 17.3 KB/sec)
[INFO] Downloading: https://repo.maven.apache.org/maven2/org/ops4j/pax/exam/pax-exam-junit4/2.4.0.RC1/pax-exam-junit4-2.4.0.RC1.jar
[INFO] Downloaded: https://repo.maven.apache.org/maven2/org/ops4j/pax/swissbox/pax-swissbox-framework/1.5.0/pax-swissbox-framework-1.5.0.jar
(12 KB at 32.0 KB/sec)
[INFO] Downloading: https://repo.maven.apache.org/maven2/org/ops4j/pax/exam/pax-exam-link-mvn/2.4.0.RC1/pax-exam-link-mvn-2.4.0.RC1.jar
[INFO] Downloaded: https://repo.maven.apache.org/maven2/org/ops4j/pax/exam/pax-exam-junit4/2.4.0.RC1/pax-exam-junit4-2.4.0.RC1.jar
(13 KB at 32.7 KB/sec)
[INFO] Downloading: https://repo.maven.apache.org/maven2/org/ops4j/pax/url/pax-url-aether/1.4.0.RC1/pax-url-aether-1.4.0.RC1.jar
[INFO] Downloaded: https://repo.maven.apache.org/maven2/org/ops4j/pax/exam/pax-exam-link-mvn/2.4.0.RC1/pax-exam-link-mvn-2.4.0.RC1.jar
(5 KB at 10.0 KB/sec)
[INFO] Downloading: https://repo.maven.apache.org/maven2/org/ops4j/pax/url/pax-url-commons/1.4.0.RC1/pax-url-commons-1.4.0.RC1.jar
[INFO] Downloaded: https://repo.maven.apache.org/maven2/org/ops4j/pax/swissbox/pax-swissbox-optional-jcl/1.5.0/pax-swissbox-optional-jcl-1.5.0.jar
(7 KB at 14.2 KB/sec)
[INFO] Downloaded: https://repo.maven.apache.org/maven2/org/infinispan/infinispan-core/5.1.8.Final/infinispan-core-5.1.8.Final.jar
(1978 KB at 4433.3 KB/sec)
[INFO] Downloading: https://repo.maven.apache.org/maven2/org/ops4j/pax/swissbox/pax-swissbox-property/1.5.0/pax-swissbox-property-1.5.0.jar
[INFO] Downloading: https://repo.maven.apache.org/maven2/org/ops4j/pax/url/pax-url-maven-commons/1.4.0.RC1/pax-url-maven-commons-1.4.0.RC1.jar
[INFO] Downloaded: https://repo.maven.apache.org/maven2/org/jgroups/jgroups/3.0.14.Final/jgroups-3.0.14.Final.jar
(1753 KB at 3850.9 KB/sec)
[INFO] Downloading: https://repo.maven.apache.org/maven2/org/ops4j/base/ops4j-base-util-xml/1.3.0/ops4j-base-util-xml-1.3.0.jar
[INFO] Downloaded: https://repo.maven.apache.org/maven2/org/ops4j/pax/url/pax-url-commons/1.4.0.RC1/pax-url-commons-1.4.0.RC1.jar
(10 KB at 20.2 KB/sec)
[INFO] Downloading: https://repo.maven.apache.org/maven2/org/ops4j/base/ops4j-base-util-collections/1.3.0/ops4j-base-util-collections-1.3.0.jar
[INFO] Downloaded: https://repo.maven.apache.org/maven2/org/ops4j/pax/url/pax-url-maven-commons/1.4.0.RC1/pax-url-maven-commons-1.4.0.RC1.jar
(17 KB at 36.3 KB/sec)
[INFO] Downloading: https://repo.maven.apache.org/maven2/org/sonatype/aether/aether-connector-wagon/1.11/aether-connector-wagon-1.11.jar
[INFO] Downloaded: https://repo.maven.apache.org/maven2/org/sonatype/aether/aether-connector-wagon/1.11/aether-connector-wagon-1.11.jar
(29 KB at 55.8 KB/sec)
[INFO] Downloading: https://repo.maven.apache.org/maven2/org/apache/maven/wagon/wagon-file/1.0-beta-7/wagon-file-1.0-beta-7.jar
[INFO] Downloaded: https://repo.maven.apache.org/maven2/org/apache/maven/wagon/wagon-file/1.0-beta-7/wagon-file-1.0-beta-7.jar
(11 KB at 20.8 KB/sec)
[INFO] Downloading: https://repo.maven.apache.org/maven2/org/apache/maven/wagon/wagon-http-lightweight/1.0-beta-7/wagon-http-lightweight-1.0-beta-7.jar
[INFO] Downloaded: https://repo.maven.apache.org/maven2/org/ops4j/base/ops4j-base-util-xml/1.3.0/ops4j-base-util-xml-1.3.0.jar
(9 KB at 15.9 KB/sec)
[INFO] Downloaded: https://repo.maven.apache.org/maven2/org/ops4j/pax/swissbox/pax-swissbox-property/1.5.0/pax-swissbox-property-1.5.0.jar
(4 KB at 6.9 KB/sec)
[INFO] Downloading: https://repo.maven.apache.org/maven2/org/apache/maven/wagon/wagon-http-shared/1.0-beta-7/wagon-http-shared-1.0-beta-7.jar
[INFO] Downloading: https://repo.maven.apache.org/maven2/org/ops4j/pax/url/pax-url-wrap/1.4.0.RC1/pax-url-wrap-1.4.0.RC1.jar
[INFO] Downloaded: https://repo.maven.apache.org/maven2/org/apache/maven/wagon/wagon-http-lightweight/1.0-beta-7/wagon-http-lightweight-1.0-beta-7.jar
(15 KB at 26.0 KB/sec)
[INFO] Downloading: https://repo.maven.apache.org/maven2/org/ops4j/pax/swissbox/pax-swissbox-bnd/1.5.0/pax-swissbox-bnd-1.5.0.jar
[INFO] Downloaded: https://repo.maven.apache.org/maven2/org/ops4j/base/ops4j-base-util-collections/1.3.0/ops4j-base-util-collections-1.3.0.jar
(8 KB at 14.2 KB/sec)
[INFO] Downloading: https://repo.maven.apache.org/maven2/org/ops4j/base/ops4j-base-net/1.2.3/ops4j-base-net-1.2.3.jar
[INFO] Downloaded: https://repo.maven.apache.org/maven2/org/ops4j/pax/url/pax-url-wrap/1.4.0.RC1/pax-url-wrap-1.4.0.RC1.jar
(12 KB at 18.9 KB/sec)
[INFO] Downloading: https://repo.maven.apache.org/maven2/org/ops4j/base/ops4j-base-monitors/1.2.3/ops4j-base-monitors-1.2.3.jar
[INFO] Downloaded: https://repo.maven.apache.org/maven2/org/apache/maven/wagon/wagon-http-shared/1.0-beta-7/wagon-http-shared-1.0-beta-7.jar
(25 KB at 41.1 KB/sec)
[INFO] Downloading: https://repo.maven.apache.org/maven2/org/apache/felix/org.apache.felix.framework/4.0.2/org.apache.felix.framework-4.0.2.jar
[INFO] Downloaded: https://repo.maven.apache.org/maven2/org/ops4j/pax/url/pax-url-aether/1.4.0.RC1/pax-url-aether-1.4.0.RC1.jar
(2579 KB at 4132.6 KB/sec)
[INFO] Downloading: https://repo.maven.apache.org/maven2/org/apache/felix/org.apache.felix.scr/1.8.0/org.apache.felix.scr-1.8.0.jar
[INFO] Downloaded: https://repo.maven.apache.org/maven2/org/apache/felix/org.apache.felix.scr/1.8.0/org.apache.felix.scr-1.8.0.jar
(259 KB at 394.1 KB/sec)
[INFO] Downloaded: https://repo.maven.apache.org/maven2/org/ops4j/pax/swissbox/pax-swissbox-bnd/1.5.0/pax-swissbox-bnd-1.5.0.jar
(9 KB at 11.8 KB/sec)
[INFO] Downloaded: https://repo.maven.apache.org/maven2/org/ops4j/base/ops4j-base-net/1.2.3/ops4j-base-net-1.2.3.jar
(12 KB at 16.1 KB/sec)
[INFO] Downloaded: https://repo.maven.apache.org/maven2/org/ops4j/base/ops4j-base-monitors/1.2.3/ops4j-base-monitors-1.2.3.jar
(8 KB at 9.8 KB/sec)
[INFO] Downloaded: https://repo.maven.apache.org/maven2/org/apache/felix/org.apache.felix.framework/4.0.2/org.apache.felix.framework-4.0.2.jar
(470 KB at 496.9 KB/sec)
[JENKINS] Archiving disabled
[JENKINS] Archiving disabled[INFO] ------------------------------------------------------------------------
[INFO] BUILD FAILURE
[INFO] ------------------------------------------------------------------------
[INFO] Total time: 16.836 s
[INFO] Finished at: 2016-10-11T19:44:20+00:00

[INFO] Final Memory: 16M/246M
[INFO] ------------------------------------------------------------------------
[ERROR] Failed to execute goal on project org.apache.sling.commons.cache.infinispan: Could
not resolve dependencies for project org.apache.sling:org.apache.sling.commons.cache.infinispan:bundle:0.1-SNAPSHOT:
The following artifacts could not be resolved: org.apache.sling:org.apache.sling.commons.cache.api:jar:0.1-SNAPSHOT,
org.apache.sling:org.apache.sling.commons.cache.impl:jar:0.1-SNAPSHOT: Could not find artifact
org.apache.sling:org.apache.sling.commons.cache.api:jar:0.1-SNAPSHOT in Nexus (http://repository.apache.org/snapshots)
-> [Help 1]
[ERROR] 
[ERROR] To see the full stack trace of the errors, re-run Maven with the -e switch.
[ERROR] Re-run Maven using the -X switch to enable full debug logging.
[ERROR] 
[ERROR] For more information about the errors and possible solutions, please read the following
articles:
[ERROR] [Help 1] http://cwiki.apache.org/confluence/display/MAVEN/DependencyResolutionException
channel stopped
Recording test results

Mime
View raw message