sling-commits mailing list archives

Site index · List index
Message view « Date » · « Thread »
Top « Date » · « Thread »
From Apache Jenkins Server <jenk...@builds.apache.org>
Subject Build failed in Jenkins: sling-contrib-scripting-org.apache.sling.scripting.thymeleaf-1.7 #1
Date Tue, 11 Oct 2016 19:46:29 GMT
See <https://builds.apache.org/job/sling-contrib-scripting-org.apache.sling.scripting.thymeleaf-1.7/1/>

------------------------------------------
Started by an SCM change
[EnvInject] - Loading node environment variables.
Building remotely on ubuntu-6 (Ubuntu yahoo-not-h2 ubuntu docker) in workspace <https://builds.apache.org/job/sling-contrib-scripting-org.apache.sling.scripting.thymeleaf-1.7/ws/>
Checking out a fresh workspace because there's no workspace at <https://builds.apache.org/job/sling-contrib-scripting-org.apache.sling.scripting.thymeleaf-1.7/ws/>
Cleaning local Directory .
Checking out https://svn.apache.org/repos/asf/sling/trunk/contrib/scripting/org.apache.sling.scripting.thymeleaf
at revision '2016-10-11T19:45:05.924 +0000'
A         src
A         src/test
A         src/test/java
A         src/test/java/org
A         src/test/java/org/apache
A         src/test/java/org/apache/sling
A         src/test/java/org/apache/sling/scripting
A         src/test/java/org/apache/sling/scripting/thymeleaf
A         src/test/java/org/apache/sling/scripting/thymeleaf/it
A         src/test/java/org/apache/sling/scripting/thymeleaf/it/app
A         src/test/java/org/apache/sling/scripting/thymeleaf/it/app/Activator.java
A         src/test/java/org/apache/sling/scripting/thymeleaf/it/app/Page.java
A         src/test/java/org/apache/sling/scripting/thymeleaf/it/app/FooBarLinkBuilder.java
A         src/test/java/org/apache/sling/scripting/thymeleaf/it/tests
A         src/test/java/org/apache/sling/scripting/thymeleaf/it/tests/html
A         src/test/java/org/apache/sling/scripting/thymeleaf/it/tests/html/ThymeleafReplaceIT.java
A         src/test/java/org/apache/sling/scripting/thymeleaf/it/tests/html/AdaptToModelIT.java
A         src/test/java/org/apache/sling/scripting/thymeleaf/it/tests/html/ThymeleafDecoupledTemplateLogicIT.java
A         src/test/java/org/apache/sling/scripting/thymeleaf/it/tests/html/SlingIncludeIT.java
A         src/test/java/org/apache/sling/scripting/thymeleaf/it/tests/html/ThymeleafTextIT.java
A         src/test/java/org/apache/sling/scripting/thymeleaf/it/tests/html/LinkBuilderIT.java
A         src/test/java/org/apache/sling/scripting/thymeleaf/it/tests/ThymeleafTestSupport.java
A         src/test/java/org/apache/sling/scripting/thymeleaf/it/tests/TemplateEngineIT.java
A         src/test/java/org/apache/sling/scripting/thymeleaf/it/tests/ThymeleafScriptEngineFactoryIT.java
A         src/test/resources
A         src/test/resources/apps
A         src/test/resources/apps/jsp
A         src/test/resources/apps/jsp/page
A         src/test/resources/apps/jsp/page/resource
A         src/test/resources/apps/jsp/page/resource/html.jsp
A         src/test/resources/apps/thymeleaf
A         src/test/resources/apps/thymeleaf/ROOT.json
A         src/test/resources/apps/thymeleaf/page
A         src/test/resources/apps/thymeleaf/page/fragments
A         src/test/resources/apps/thymeleaf/page/fragments/head.html
A         src/test/resources/apps/thymeleaf/page/replace
A         src/test/resources/apps/thymeleaf/page/replace/html.html
A         src/test/resources/apps/thymeleaf/page/adaptto
A         src/test/resources/apps/thymeleaf/page/adaptto/html.html
A         src/test/resources/apps/thymeleaf/page/link
A         src/test/resources/apps/thymeleaf/page/link/html.html
A         src/test/resources/apps/thymeleaf/page/include
A         src/test/resources/apps/thymeleaf/page/include/html.html
A         src/test/resources/apps/thymeleaf/page/decoupled
A         src/test/resources/apps/thymeleaf/page/decoupled/html.html
A         src/test/resources/apps/thymeleaf/page/decoupled/html.th.xml
A         src/test/resources/apps/thymeleaf/page/main
A         src/test/resources/apps/thymeleaf/page/main/html.html
A         src/test/resources/apps/thymeleaf/page/text
A         src/test/resources/apps/thymeleaf/page/text/html.html
A         src/test/resources/content
A         src/test/resources/content/thymeleaf.json
A         src/main
A         src/main/java
A         src/main/java/org
A         src/main/java/org/thymeleaf
A         src/main/java/org/thymeleaf/templateresolver
AU        src/main/java/org/thymeleaf/templateresolver/AbstractTemplateResolver.java
AU        src/main/java/org/thymeleaf/templateresolver/ITemplateResolver.java
A         src/main/java/org/thymeleaf/engine
A         src/main/java/org/thymeleaf/engine/TemplateManager.java
A         src/main/java/org/apache
A         src/main/java/org/apache/sling
A         src/main/java/org/apache/sling/scripting
A         src/main/java/org/apache/sling/scripting/thymeleaf
A         src/main/java/org/apache/sling/scripting/thymeleaf/AbsentMessageRepresentationProvider.java
A         src/main/java/org/apache/sling/scripting/thymeleaf/package-info.java
A         src/main/java/org/apache/sling/scripting/thymeleaf/TemplateModeProvider.java
A         src/main/java/org/apache/sling/scripting/thymeleaf/internal
A         src/main/java/org/apache/sling/scripting/thymeleaf/internal/PatternTemplateModeProviderConfiguration.java
A         src/main/java/org/apache/sling/scripting/thymeleaf/internal/ThymeleafScriptEngineFactory.java
A         src/main/java/org/apache/sling/scripting/thymeleaf/internal/SlingResourceTemplateResolver.java
A         src/main/java/org/apache/sling/scripting/thymeleaf/internal/dialect
A         src/main/java/org/apache/sling/scripting/thymeleaf/internal/dialect/SlingDialect.java
A         src/main/java/org/apache/sling/scripting/thymeleaf/internal/ResourceBundleMessageResolver.java
A         src/main/java/org/apache/sling/scripting/thymeleaf/internal/PatternTemplateModeProvider.java
A         src/main/java/org/apache/sling/scripting/thymeleaf/internal/ThymeleafScriptEngine.java
A         src/main/java/org/apache/sling/scripting/thymeleaf/internal/ThymeleafScriptEngineFactoryConfiguration.java
A         src/main/java/org/apache/sling/scripting/thymeleaf/internal/SlingResourceTemplateResolverConfiguration.java
A         src/main/java/org/apache/sling/scripting/thymeleaf/internal/processor
A         src/main/java/org/apache/sling/scripting/thymeleaf/internal/processor/SlingIncludeAttributeTagProcessor.java
A         src/main/java/org/apache/sling/scripting/thymeleaf/internal/ResourceBundleMessageResolverConfiguration.java
A         src/main/java/org/apache/sling/scripting/thymeleaf/internal/SlingTemplateResource.java
A         src/site
AU        src/site/diagram.png
A         src/site/thymeleaf.uml
A         pom.xml
A         README.md
 U        .
At revision 1764329

Parsing POMs
Discovered a new module org.apache.sling:org.apache.sling.scripting.thymeleaf Apache Sling
Scripting Thymeleaf
Modules changed, recalculating dependency graph
Established TCP socket on 44642
maven32-agent.jar already up to date
maven32-interceptor.jar already up to date
maven3-interceptor-commons.jar already up to date
[sling-contrib-scripting-org.apache.sling.scripting.thymeleaf-1.7] $ /home/jenkins/tools/java/latest1.7/bin/java
-Xmx2g -Xms256m -XX:MaxPermSize=512m -cp /home/jenkins/jenkins-slave/maven32-agent.jar:/home/jenkins/tools/maven/apache-maven-3.3.9/boot/plexus-classworlds-2.5.2.jar:/home/jenkins/tools/maven/apache-maven-3.3.9/conf/logging
jenkins.maven3.agent.Maven32Main /home/jenkins/tools/maven/apache-maven-3.3.9 /home/jenkins/jenkins-slave/slave.jar
/home/jenkins/jenkins-slave/maven32-interceptor.jar /home/jenkins/jenkins-slave/maven3-interceptor-commons.jar
44642
<===[JENKINS REMOTING CAPACITY]===>   channel started
Executing Maven:  -B -f <https://builds.apache.org/job/sling-contrib-scripting-org.apache.sling.scripting.thymeleaf-1.7/ws/pom.xml>
-Dmaven.repo.local=/home/jenkins/jenkins-slave/maven-repositories/0 -U clean deploy
[INFO] Scanning for projects...
[INFO]                                                                         
[INFO] ------------------------------------------------------------------------
[INFO] Building Apache Sling Scripting Thymeleaf 1.0.1-SNAPSHOT
[INFO] ------------------------------------------------------------------------
[INFO] Downloading: https://repo.maven.apache.org/maven2/org/thymeleaf/thymeleaf/3.0.2.RELEASE/thymeleaf-3.0.2.RELEASE.pom
[INFO] Downloaded: https://repo.maven.apache.org/maven2/org/thymeleaf/thymeleaf/3.0.2.RELEASE/thymeleaf-3.0.2.RELEASE.pom
(11 KB at 16.0 KB/sec)
[INFO] Downloading: https://repo.maven.apache.org/maven2/org/attoparser/attoparser/2.0.1.RELEASE/attoparser-2.0.1.RELEASE.pom
[INFO] Downloaded: https://repo.maven.apache.org/maven2/org/attoparser/attoparser/2.0.1.RELEASE/attoparser-2.0.1.RELEASE.pom
(10 KB at 170.8 KB/sec)
[INFO] Downloading: https://repo.maven.apache.org/maven2/org/unbescape/unbescape/1.1.4.RELEASE/unbescape-1.1.4.RELEASE.pom
[INFO] Downloaded: https://repo.maven.apache.org/maven2/org/unbescape/unbescape/1.1.4.RELEASE/unbescape-1.1.4.RELEASE.pom
(10 KB at 197.5 KB/sec)
[INFO] Downloading: https://repo.maven.apache.org/maven2/org/thymeleaf/thymeleaf/3.0.2.RELEASE/thymeleaf-3.0.2.RELEASE.jar
[INFO] Downloading: https://repo.maven.apache.org/maven2/org/attoparser/attoparser/2.0.1.RELEASE/attoparser-2.0.1.RELEASE.jar
[INFO] Downloading: https://repo.maven.apache.org/maven2/org/unbescape/unbescape/1.1.4.RELEASE/unbescape-1.1.4.RELEASE.jar
[INFO] Downloaded: https://repo.maven.apache.org/maven2/org/unbescape/unbescape/1.1.4.RELEASE/unbescape-1.1.4.RELEASE.jar
(161 KB at 1011.5 KB/sec)
[INFO] Downloaded: https://repo.maven.apache.org/maven2/org/attoparser/attoparser/2.0.1.RELEASE/attoparser-2.0.1.RELEASE.jar
(228 KB at 1148.1 KB/sec)
[INFO] Downloaded: https://repo.maven.apache.org/maven2/org/thymeleaf/thymeleaf/3.0.2.RELEASE/thymeleaf-3.0.2.RELEASE.jar
(829 KB at 2698.1 KB/sec)
[INFO] 
[INFO] --- maven-clean-plugin:3.0.0:clean (default-clean) @ org.apache.sling.scripting.thymeleaf
---
[INFO] 
[INFO] --- maven-enforcer-plugin:1.4.1:enforce (enforce-java) @ org.apache.sling.scripting.thymeleaf
---
[INFO] 
[INFO] --- maven-antrun-plugin:1.8:run (set-bundle-required-execution-environment) @ org.apache.sling.scripting.thymeleaf
---
[INFO] Executing tasks

main:
Setting Bundle-RequiredExecutionEnvironment=JavaSE-1.8 from sling.java.version=8
[INFO] Executed tasks
[INFO] 
[INFO] --- maven-remote-resources-plugin:1.5:process (process-resource-bundles) @ org.apache.sling.scripting.thymeleaf
---
[INFO] 
[INFO] --- maven-remote-resources-plugin:1.5:process (default) @ org.apache.sling.scripting.thymeleaf
---
[INFO] 
[INFO] --- depends-maven-plugin:1.2:generate-depends-file (default) @ org.apache.sling.scripting.thymeleaf
---
[INFO] Created: <https://builds.apache.org/job/sling-contrib-scripting-org.apache.sling.scripting.thymeleaf-1.7/ws/target/classes/META-INF/maven/dependencies.properties>
[INFO] 
[INFO] --- maven-resources-plugin:2.7:resources (default-resources) @ org.apache.sling.scripting.thymeleaf
---
[INFO] Using 'UTF-8' encoding to copy filtered resources.
[INFO] skip non existing resourceDirectory <https://builds.apache.org/job/sling-contrib-scripting-org.apache.sling.scripting.thymeleaf-1.7/ws/src/main/resources>
[INFO] Copying 3 resources
[INFO] Copying 3 resources
[INFO] 
[INFO] --- maven-compiler-plugin:3.5.1:compile (default-compile) @ org.apache.sling.scripting.thymeleaf
---
[INFO] Changes detected - recompiling the module!
[INFO] Compiling 18 source files to <https://builds.apache.org/job/sling-contrib-scripting-org.apache.sling.scripting.thymeleaf-1.7/ws/target/classes>
[JENKINS] Archiving disabled
[JENKINS] Archiving disabled[INFO] ------------------------------------------------------------------------
[INFO] BUILD FAILURE
[INFO] ------------------------------------------------------------------------
[INFO] Total time: 10.921 s
[INFO] Finished at: 2016-10-11T19:44:58+00:00

[INFO] Final Memory: 26M/452M
[INFO] ------------------------------------------------------------------------
Waiting for Jenkins to finish collecting data
[ERROR] Failed to execute goal org.apache.maven.plugins:maven-compiler-plugin:3.5.1:compile
(default-compile) on project org.apache.sling.scripting.thymeleaf: Fatal error compiling:
invalid target release: 1.8 -> [Help 1]
[ERROR] 
[ERROR] To see the full stack trace of the errors, re-run Maven with the -e switch.
[ERROR] Re-run Maven using the -X switch to enable full debug logging.
[ERROR] 
[ERROR] For more information about the errors and possible solutions, please read the following
articles:
[ERROR] [Help 1] http://cwiki.apache.org/confluence/display/MAVEN/MojoExecutionException
channel stopped
Recording test results

Mime
View raw message