sling-commits mailing list archives

Site index · List index
Message view « Date » · « Thread »
Top « Date » · « Thread »
From Apache Jenkins Server <jenk...@builds.apache.org>
Subject Build failed in Jenkins: sling-trunk-1.8 #3961
Date Sun, 11 Sep 2016 14:06:58 GMT
See <https://builds.apache.org/job/sling-trunk-1.8/3961/>

------------------------------------------
[...truncated 148605 lines...]
[INFO] Apache Sling Authentication Service ................ SUCCESS [  8.599 s]
[INFO] Apache Sling Form Based Authentication Handler ..... SUCCESS [ 12.560 s]
[INFO] Apache Sling Engine Implementation ................. SUCCESS [ 22.390 s]
[INFO] Apache Sling Repository API Bundle ................. SUCCESS [  2.490 s]
[INFO] Apache Sling JCR Base Bundle ....................... SUCCESS [  7.494 s]
[INFO] Apache Sling Pax Exam Utilities .................... SUCCESS [ 58.959 s]
[INFO] Apache Sling Initial Content Loader ................ SUCCESS [01:47 min]
[INFO] Apache Sling Jackrabbit Embedded Repository ........ SUCCESS [ 13.597 s]
[INFO] Apache Sling Jackrabbit UserManager Support ........ SUCCESS [  4.158 s]
[INFO] Apache Sling Jackrabbit JSR-283 Access Control Manager Support SUCCESS [  2.623 s]
[INFO] Apache Sling Wrapper Bundle for the JCR API ........ SUCCESS [  4.309 s]
[INFO] Apache Sling JCR Resource Resolver ................. SUCCESS [ 49.011 s]
[INFO] Apache Sling Versioning Integration Tests .......... SUCCESS [ 15.550 s]
[INFO] Apache Sling JCR Repository Registration ........... SUCCESS [  5.233 s]
[INFO] Apache Sling Simple WebDAV Access to repositories .. SUCCESS [  4.385 s]
[INFO] Apache Sling DavEx Access to repositories .......... SUCCESS [  5.801 s]
[INFO] Apache Sling JCR WebConsole Bundle ................. SUCCESS [  2.717 s]
[INFO] Apache Sling Testing PaxExam ....................... SUCCESS [ 37.109 s]
[INFO] Apache Sling JCR Oak Repository Server ............. SUCCESS [ 38.092 s]
[INFO] Apache Sling SlingRepository Integration Tests ..... SUCCESS [01:55 min]
[INFO] Apache Sling RepoInit Parser ....................... SUCCESS [  8.627 s]
[INFO] Apache Sling RepoInit JCR module ................... SUCCESS [ 27.863 s]
[INFO] Apache Sling Servlet Resolver ...................... SUCCESS [  5.824 s]
[INFO] Apache Sling Default GET Servlets .................. SUCCESS [  5.743 s]
[INFO] Apache Sling Default POST Servlets ................. SUCCESS [  6.383 s]
[INFO] Apache Sling Compat Servlets ....................... SUCCESS [  2.616 s]
[INFO] Apache Sling Scripting Implementation API .......... SUCCESS [  2.158 s]
[INFO] Apache Sling Scripting Core implementation ......... SUCCESS [ 28.941 s]
[INFO] Apache Sling Scripting JavaScript Support .......... SUCCESS [ 28.411 s]
[INFO] Apache Sling Scripting JSP Support ................. SUCCESS [  9.423 s]
[INFO] Apache Sling JSP Tag Library ....................... SUCCESS [  7.540 s]
[INFO] Apache Sling JSP Standard Tag Library .............. SUCCESS [  3.363 s]
[INFO] Apache Sling Scripting HTL Compiler ................ SUCCESS [ 53.862 s]
[INFO] Apache Sling Scripting HTL Java Compiler ........... SUCCESS [ 29.194 s]
[INFO] Apache Sling Scripting HTL Engine .................. SUCCESS [ 26.917 s]
[INFO] Apache Sling Scripting HTL JavaScript Use Provider . SUCCESS [  3.701 s]
[INFO] Apache Sling Scripting HTL Sling Models Use Provider SUCCESS [  2.507 s]
[INFO] Apache Sling Scripting HTL Read-Eval-Print Loop Environment SUCCESS [  2.952 s]
[INFO] Apache Sling Scripting HTL Integration Tests Content SUCCESS [  6.688 s]
[INFO] Apache Sling Launchpad Base ........................ SUCCESS [ 22.037 s]
[INFO] Apache Sling Subsystems Base Installer ............. SUCCESS [  4.023 s]

[INFO] Apache Sling Filesystem Resource Provider .......... SUCCESS [  2.779 s]
[INFO] Apache Sling Installer WebConsole Plugin ........... SUCCESS [  4.384 s]
[INFO] Apache Sling JCR Installer ......................... SUCCESS [02:04 min]
[INFO] Apache Sling XSS Protection Bundle ................. SUCCESS [ 17.227 s]
[INFO] Apache Sling Launchpad Application Builder ......... SUCCESS [01:00 min]
[INFO] Apache Sling Scripting HTL Integration Tests ....... SUCCESS [03:34 min]
[INFO] Apache Sling Scripting HTL Reactor ................. SUCCESS [  2.440 s]
[INFO] Apache Sling Adapter Manager Implementation ........ SUCCESS [  3.933 s]
[INFO] Apache Sling Bundle Resource Provider .............. SUCCESS [  2.527 s]
[INFO] Apache Sling Distributed Event Admin ............... SUCCESS [  3.869 s]
[INFO] Apache Sling Discovery API ......................... SUCCESS [  2.334 s]
[INFO] Apache Sling Discovery Commons ..................... SUCCESS [ 55.034 s]
[INFO] Apache Sling Discovery Base ........................ SUCCESS [ 59.995 s]
[INFO] Apache Sling Resource-Based Discovery Service ...... SUCCESS [03:13 min]
[INFO] Apache Sling Oak-Based Discovery Service ........... SUCCESS [02:40 min]
[INFO] Apache Sling Discovery Support Bundle .............. SUCCESS [  2.308 s]
[INFO] Apache Sling Discovery Standalone Implementation ... SUCCESS [  3.709 s]
[INFO] Apache Sling Event Support ......................... SUCCESS [25:20 min]
[INFO] Apache Sling Feature Flags ......................... SUCCESS [  2.777 s]
[INFO] Apache Sling javax.activation bundle ............... SUCCESS [  2.804 s]
[INFO] Apache Sling Service User Mapper ................... SUCCESS [  4.920 s]
[INFO] Apache Sling Settings .............................. SUCCESS [  4.070 s]
[INFO] Apache Sling Web Console Branding .................. SUCCESS [  2.090 s]
[INFO] Apache Sling Web Console Security Provider ......... SUCCESS [  2.503 s]
[INFO] Apache Sling Explorer .............................. SUCCESS [  2.530 s]
[INFO] Apache Sling Health Check Core ..................... SUCCESS [03:29 min]
[INFO] Apache Sling Health Check Samples .................. SUCCESS [  4.248 s]
[INFO] Apache Sling Health Check Support Components ....... SUCCESS [  4.188 s]
[INFO] Apache Sling Health Check Webconsole Plugin ........ SUCCESS [  2.530 s]
[INFO] Apache Sling Health Check JUnit Bridge ............. SUCCESS [  3.791 s]
[INFO] Apache Sling Health Check Annotations .............. SUCCESS [  2.745 s]
[INFO] Apache Sling Health Check Integration Tests ........ SUCCESS [  6.578 s]
[INFO] Apache Sling Health Check Reactor POM .............. SUCCESS [  1.569 s]
[INFO] Apache Sling Resource Access Security .............. SUCCESS [  2.918 s]
[INFO] Apache Sling Resource Access Security Integration Tests SUCCESS [ 40.359 s]
[INFO] Apache Sling Models API ............................ SUCCESS [  2.719 s]
[INFO] Apache Sling Models Implementation ................. SUCCESS [  9.635 s]
[INFO] Apache Sling Models Integration Tests .............. SUCCESS [ 46.571 s]
[INFO] Apache Sling Validation Framework API .............. SUCCESS [  0.631 s]
[INFO] Apache Sling Models Validation Implementation ...... SUCCESS [  0.486 s]
[INFO] Apache Sling Models Reactor ........................ SUCCESS [  1.784 s]
[INFO] Apache Sling Internationalization Support .......... SUCCESS [01:09 min]
[INFO] Apache Sling JUnit Core ............................ SUCCESS [  4.939 s]
[INFO] Apache Sling JUnit Tests Teleporter ................ SUCCESS [ 12.173 s]
[INFO] Apache Sling Resource Builder ...................... SUCCESS [ 46.024 s]
[INFO] Apache Sling Servlet Helpers ....................... SUCCESS [  4.216 s]
[INFO] Apache Sling RepoInit Integration Tests ............ SUCCESS [ 37.845 s]
[INFO] Apache Sling RepoInit Reactor ...................... SUCCESS [  3.343 s]
[INFO] Apache Sling Test Tools ............................ SUCCESS [  6.995 s]
[INFO] Apache Sling Testing Clients ....................... SUCCESS [  9.754 s]
[INFO] Apache Sling Testing Hamcrest ...................... SUCCESS [  3.907 s]
[INFO] Apache Sling Server Setup Tools .................... SUCCESS [  4.251 s]
[INFO] Apache Sling Testing Rules ......................... SUCCESS [  7.814 s]
[INFO] Apache Sling JUnit Scriptable Tests Provider ....... SUCCESS [  3.759 s]
[INFO] Apache Sling JUnit Health Checks ................... SUCCESS [  2.948 s]
[INFO] Apache Sling JUnit Remote Tests Runners ............ SUCCESS [  3.252 s]
[INFO] Apache Sling JUnit Performance ..................... SUCCESS [  3.305 s]
[INFO] Apache Sling Testing Mock Log Configuration ........ SUCCESS [  2.246 s]
[INFO] Apache Sling Testing Resource Resolver Mock ........ SUCCESS [  3.380 s]
[INFO] Apache Sling Testing JCR Mock ...................... SUCCESS [  4.664 s]
[INFO] Apache Sling Testing OSGi Mock ..................... SUCCESS [ 10.856 s]
[INFO] Apache Sling Testing Sling Mock .................... SUCCESS [ 22.327 s]
[INFO] Apache Sling Testing Sling Mock Oak-based Resource Resolver SUCCESS [ 50.038 s]
[INFO] Apache Sling Testing Mocks Modules Reactor ......... SUCCESS [  3.389 s]
[INFO] Apache Sling Testing - sample bundle with integration tests SUCCESS [ 42.950 s]
[INFO] Apache Sling Testing - sample module with integration tests SUCCESS [ 37.129 s]
[INFO] Apache Sling Testing Modules Reactor ............... SUCCESS [  3.154 s]
[INFO] Apache Sling Installer ............................. SUCCESS [  6.457 s]
[INFO] Apache Sling File Installer ........................ SUCCESS [  3.123 s]
[INFO] Apache Sling Installer Configuration Admin Support . SUCCESS [  3.083 s]
[INFO] Apache Sling Deployment Package Installer .......... SUCCESS [  2.377 s]
[INFO] Apache Sling Subsystems Installer .................. SUCCESS [  2.624 s]
[INFO] Apache Sling Installer Health Checks ............... SUCCESS [  2.927 s]
[INFO] Apache Sling Installer Integration Tests ........... SUCCESS [01:02 min]
[INFO] Apache Sling Launchpad API ......................... SUCCESS [  2.912 s]
[INFO] Apache Sling Launchpad Installer ................... SUCCESS [  5.256 s]
[INFO] Apache Sling Launchpad Content ..................... SUCCESS [  2.135 s]
[INFO] Apache Sling Validation Framework Core Implementation SUCCESS [  5.144 s]
[INFO] Apache Sling Validation Framework Testing Services . SUCCESS [  1.121 s]
[INFO] Apache Sling Validation Framework Integration Tests  FAILURE [04:03 min]
[INFO] Apache Sling Validation Framework Examples ......... SKIPPED
[INFO] Apache Sling Validation Framework Builder .......... SKIPPED
[INFO] Apache Sling Launchpad Testing Services ............ SKIPPED
[INFO] Apache Sling Launchpad Testing Services WAR ........ SKIPPED
[INFO] Apache Sling Launchpad Testing Fragment Bundle ..... SKIPPED
[INFO] Apache Sling Launchpad Test Bundles ................ SKIPPED
[INFO] Apache Sling Integration Tests ..................... SKIPPED
[INFO] Apache Sling Launchpad Testing ..................... SKIPPED
[INFO] Apache Sling (Builder) ............................. SKIPPED
[INFO] ------------------------------------------------------------------------
[INFO] BUILD FAILURE
[INFO] ------------------------------------------------------------------------
[INFO] Total time: 01:20 h
[INFO] Finished at: 2016-09-11T14:02:46+00:00
[INFO] Final Memory: 312M/472M
[INFO] ------------------------------------------------------------------------
Waiting for Jenkins to finish collecting data
[ERROR] Failed to execute goal org.apache.maven.plugins:maven-failsafe-plugin:2.18.1:verify
(verify) on project org.apache.sling.validation.it-http: There are test failures.
[ERROR] 
[ERROR] Please refer to <https://builds.apache.org/job/sling-trunk-1.8/ws/trunk/bundles/extensions/validation/it-http/target/failsafe-reports>
for the individual test results.
[ERROR] -> [Help 1]
[ERROR] 
[ERROR] To see the full stack trace of the errors, re-run Maven with the -e switch.
[ERROR] Re-run Maven using the -X switch to enable full debug logging.
[ERROR] 
[ERROR] For more information about the errors and possible solutions, please read the following
articles:
[ERROR] [Help 1] http://cwiki.apache.org/confluence/display/MAVEN/MojoFailureException
[ERROR] 
[ERROR] After correcting the problems, you can resume the build with the command
[ERROR]   mvn <goals> -rf :org.apache.sling.validation.it-http
channel stopped
Found 18 test results
Found 95 test results
Found 41 test results
Found 8 test results
Found 4 test results
Found failed test junit/org.apache.sling.commons.classloader.it/DynamicClassLoaderIT
Found failed test junit/org.apache.sling.commons.classloader.it/DynamicClassLoaderIT/testPackageAdminClassLoader
Found 2 test results
Found 17 test results
Found 4 test results
Found 94 test results
Found 44 test results
Found 10 test results
Found 21 test results
Found 9 test results
Found 36 test results
Found 42 test results
Found 22 test results
Found 10 test results
Found failed test junit/org.apache.sling.commons.threads.impl/ThreadExpiringThreadPoolTest
Found failed test junit/org.apache.sling.commons.threads.impl/ThreadExpiringThreadPoolTest/shouldLetMultipleThreadsDieAfterExpiry
Found 31 test results
Found 83 test results
Found 50 test results
Found 30 test results
Found 5 test results
Found 95 test results
Found 77 test results
Found failed test junit/org.apache.sling.event.it/ChaosTest
Found failed test junit/org.apache.sling.event.it/ChaosTest/testDoChaos
Found 4 test results
Found 94 test results
Found 3 test results
Found 8 test results
Found 2 test results
Found 13 test results
Found 31 test results
Found 53 test results
Found 4 test results
Found 3 test results
Found 47 test results
Found 38 test results
Found 9 test results
Found 96 test results
Found 8 test results
Found 17 test results
Found 45 test results
Found 34 test results
Found 9 test results
Found 94 test results
Found 37 test results
Found 4 test results
Found 16 test results
Found 3 test results
Found 2 test results
Found 23 test results
Found 3 test results
Found 75 test results
Found 6 test results
Found 188 test results
Found 19 test results
Found 10 test results
Found 49 test results
Found 8 test results
Found 35 test results
Found 21 test results
Found 33 test results
Found 210 test results
Found 24 test results
Found 81 test results
Found 27 test results
Found 24 test results
Found 13 test results
Found 2 test results
Found 394 test results
Found 17 test results
Found 58 test results
Found 28 test results
Found 50 test results
Found 92 test results
Found 18 test results
Found 164 test results
Found 8 test results
Found 70 test results
Found 103 test results
Found 18 test results
Found 50 test results
Found 77 test results
Found 15 test results
Found 2 test results
Found 13 test results
Found 155 test results
Found 47 test results
Found 26 test results
Found 2 test results
Found 27 test results

Mime
View raw message