sling-commits mailing list archives

Site index · List index
Message view « Date » · « Thread »
Top « Date » · « Thread »
From Apache Jenkins Server <jenk...@builds.apache.org>
Subject Build failed in Jenkins: sling-trunk-1.7 #4362
Date Tue, 26 Jul 2016 02:23:47 GMT
See <https://builds.apache.org/job/sling-trunk-1.7/4362/>

------------------------------------------
[...truncated 120730 lines...]
[JENKINS] Archiving disabled
[JENKINS] Archiving disabled
[JENKINS] Archiving disabled
[JENKINS] Archiving disabled
[JENKINS] Archiving disabled
[JENKINS] Archiving disabled
[JENKINS] Archiving disabled
[JENKINS] Archiving disabled
[JENKINS] Archiving disabled
[JENKINS] Archiving disabled
[JENKINS] Archiving disabled
[JENKINS] Archiving disabled
[JENKINS] Archiving disabled
[JENKINS] Archiving disabled
[JENKINS] Archiving disabled
[JENKINS] Archiving disabled
[JENKINS] Archiving disabled
[JENKINS] Archiving disabled
[JENKINS] Archiving disabled
[JENKINS] Archiving disabled
[JENKINS] Archiving disabled
[JENKINS] Archiving disabled
[JENKINS] Archiving disabled
[JENKINS] Archiving disabled
[JENKINS] Archiving disabled
[JENKINS] Archiving disabled
[JENKINS] Archiving disabled
[JENKINS] Archiving disabled
[JENKINS] Archiving disabled
[JENKINS] Archiving disabled
[JENKINS] Archiving disabled
[JENKINS] Archiving disabled
[JENKINS] Archiving disabled
[JENKINS] Archiving disabled
[JENKINS] Archiving disabled
[JENKINS] Archiving disabled
[JENKINS] Archiving disabled
[JENKINS] Archiving disabled
[JENKINS] Archiving disabled
[JENKINS] Archiving disabled
[JENKINS] Archiving disabled
[JENKINS] Archiving disabled
[JENKINS] Archiving disabled
[JENKINS] Archiving disabled
[JENKINS] Archiving disabled
[JENKINS] Archiving disabled
[JENKINS] Archiving disabled
[JENKINS] Archiving disabled
[JENKINS] Archiving disabled
[JENKINS] Archiving disabled
[JENKINS] Archiving disabled
[JENKINS] Archiving disabled
[JENKINS] Archiving disabled
[JENKINS] Archiving disabled
[JENKINS] Archiving disabled
[JENKINS] Archiving disabled
[JENKINS] Archiving disabled
[JENKINS] Archiving disabled
[JENKINS] Archiving disabled
[JENKINS] Archiving disabled
[JENKINS] Archiving disabled
[JENKINS] Archiving disabled
[JENKINS] Archiving disabled
[JENKINS] Archiving disabled
[JENKINS] Archiving disabled
[JENKINS] Archiving disabled
[JENKINS] Archiving disabled
[JENKINS] Archiving disabled
[JENKINS] Archiving disabled
[JENKINS] Archiving disabled
[JENKINS] Archiving disabled
[JENKINS] Archiving disabled
[JENKINS] Archiving disabled
[JENKINS] Archiving disabled
[JENKINS] Archiving disabled
[JENKINS] Archiving disabled
[JENKINS] Archiving disabled
[JENKINS] Archiving disabled
[JENKINS] Archiving disabled
[JENKINS] Archiving disabled
[JENKINS] Archiving disabled
[JENKINS] Archiving disabled[INFO] ------------------------------------------------------------------------
[INFO] Reactor Summary:
[INFO] 
[INFO] Apache Sling JAR Resource Bundle ................... SUCCESS [ 14.181 s]
[INFO] Apache Sling (Parent) .............................. SUCCESS [ 13.293 s]
[INFO] Apache Sling Tooling Support Install ............... SUCCESS [ 17.545 s]
[INFO] Apache Sling Provisioning Model .................... SUCCESS [ 22.639 s]
[INFO] Apache Sling Tooling Support Source ................ SUCCESS [ 10.584 s]
[INFO] Apache Sling Testing Utilities ..................... SUCCESS [ 32.411 s]
[INFO] Apache Sling API ................................... SUCCESS [ 20.992 s]
[INFO] Apache Sling Resource Resolver ..................... SUCCESS [ 22.387 s]
[INFO] Apache Sling System Bundle Extension: Java Transaction API SUCCESS [ 10.727 s]
[INFO] Apache Sling System Bundle Extension: XML APIs ..... SUCCESS [ 11.584 s]
[INFO] Apache Sling System Bundle Extension: Activation API SUCCESS [  8.848 s]
[INFO] Apache Sling System Bundle Extension: WS APIs ...... SUCCESS [  9.023 s]
[INFO] Apache Sling Dynamic Class Loader Support .......... SUCCESS [ 22.354 s]
[INFO] Apache Sling Commons FileSystem ClassLoader ........ SUCCESS [ 11.925 s]
[INFO] Apache Sling Commons Java Compiler ................. SUCCESS [ 13.817 s]
[INFO] Apache Sling JSON Library .......................... SUCCESS [ 19.068 s]
[INFO] Apache Sling SLF4J Implementation (Logback) ........ SUCCESS [01:02 min]
[INFO] Apache Sling OSGi LogService Implementation ........ SUCCESS [ 10.440 s]
[INFO] Apache Sling MIME type mapping support ............. SUCCESS [ 13.245 s]
[INFO] Apache Sling Content Detection Support ............. SUCCESS [01:06 min]
[INFO] Apache Sling Commons OSGi support .................. SUCCESS [ 14.463 s]
[INFO] Apache Sling Scheduler Support ..................... SUCCESS [ 15.726 s]
[INFO] Apache Sling Thread Dumper ......................... SUCCESS [  9.086 s]
[INFO] Apache Sling Thread Support ........................ SUCCESS [ 19.497 s]
[INFO] Apache Sling Metrics ............................... SUCCESS [ 14.635 s]
[INFO] Apache Sling Authentication Service ................ SUCCESS [ 12.730 s]
[INFO] Apache Sling Form Based Authentication Handler ..... SUCCESS [ 17.001 s]
[INFO] Apache Sling Engine Implementation ................. SUCCESS [ 24.169 s]
[INFO] Apache Sling Repository API Bundle ................. SUCCESS [  8.968 s]
[INFO] Apache Sling JCR Base Bundle ....................... SUCCESS [ 12.770 s]
[INFO] Apache Sling Pax Exam Utilities .................... SUCCESS [ 55.695 s]
[INFO] Apache Sling Initial Content Loader ................ SUCCESS [01:29 min]
[INFO] Apache Sling Jackrabbit Embedded Repository ........ SUCCESS [ 20.013 s]
[INFO] Apache Sling Jackrabbit UserManager Support ........ SUCCESS [ 11.201 s]
[INFO] Apache Sling Jackrabbit JSR-283 Access Control Manager Support SUCCESS [ 10.195 s]
[INFO] Apache Sling Wrapper Bundle for the JCR API ........ SUCCESS [  9.132 s]
[INFO] Apache Sling JCR Resource Resolver ................. SUCCESS [01:03 min]
[INFO] Apache Sling Versioning Integration Tests .......... SUCCESS [ 21.812 s]
[INFO] Apache Sling JCR Repository Registration ........... SUCCESS [ 11.777 s]
[INFO] Apache Sling Simple WebDAV Access to repositories .. SUCCESS [ 10.845 s]
[INFO] Apache Sling DavEx Access to repositories .......... SUCCESS [ 11.484 s]
[INFO] Apache Sling JCR WebConsole Bundle ................. SUCCESS [  9.219 s]
[INFO] Apache Sling Oak Repository Server ................. SUCCESS [ 12.313 s]
[INFO] Apache Sling SlingRepository Integration Tests ..... SUCCESS [01:49 min]
[INFO] Apache Sling RepoInit Parser ....................... SUCCESS [ 11.947 s]
[INFO] Apache Sling RepoInit JCR module ................... SUCCESS [ 28.241 s]
[INFO] Apache Sling Servlet Resolver ...................... SUCCESS [ 12.986 s]
[INFO] Apache Sling Default GET Servlets .................. SUCCESS [ 12.258 s]
[INFO] Apache Sling Default POST Servlets ................. SUCCESS [ 13.219 s]
[INFO] Apache Sling Compat Servlets ....................... SUCCESS [  9.160 s]
[INFO] Apache Sling Scripting Implementation API .......... SUCCESS [  9.061 s]
[INFO] Apache Sling Scripting Core implementation ......... SUCCESS [ 33.261 s]
[INFO] Apache Sling Scripting JavaScript Support .......... SUCCESS [ 32.371 s]
[INFO] Apache Sling Scripting JSP Support ................. SUCCESS [ 15.998 s]
[INFO] Apache Sling JSP Tag Library ....................... SUCCESS [ 14.745 s]
[INFO] Apache Sling JSP Standard Tag Library .............. SUCCESS [  9.803 s]
[INFO] Apache Sling Scripting Sightly Compiler ............ SUCCESS [ 50.006 s]
[INFO] Apache Sling Scripting Sightly Java Compiler ....... SUCCESS [ 30.459 s]
[INFO] Apache Sling Scripting Sightly Engine .............. SUCCESS [ 34.046 s]
[INFO] Apache Sling Scripting Sightly JavaScript Use Provider SUCCESS [ 10.367 s]
[INFO] Apache Sling Scripting Sightly Models Use Provider . SUCCESS [  9.574 s]
[INFO] Apache Sling Scripting Sightly Read-Eval-Print Loop Environment SUCCESS [ 10.134 s]
[INFO] Apache Sling Scripting Sightly Integration Tests Content SUCCESS [ 13.653 s]
[INFO] Apache Sling Launchpad Base ........................ SUCCESS [ 31.825 s]
[INFO] Apache Sling Subsystems Base Installer ............. SUCCESS [ 11.106 s]
[INFO] Apache Sling Filesystem Resource Provider .......... SUCCESS [ 14.763 s]
[INFO] Apache Sling Installer WebConsole Plugin ........... SUCCESS [  9.713 s]
[INFO] Apache Sling Launchpad Application Builder ......... SUCCESS [01:01 min]
[INFO] Apache Sling Scripting Sightly Integration Tests ... SUCCESS [05:38 min]
[INFO] Apache Sling Scripting Sightly Reactor ............. SUCCESS [  5.664 s]
[INFO] Apache Sling Adapter Manager Implementation ........ SUCCESS [ 11.464 s]
[INFO] Apache Sling Bundle Resource Provider .............. SUCCESS [  9.270 s]
[INFO] Apache Sling Distributed Event Admin ............... SUCCESS [ 12.032 s]
[INFO] Apache Sling Discovery API ......................... SUCCESS [  9.427 s]
[INFO] Apache Sling Discovery Commons ..................... SUCCESS [01:03 min]
[INFO] Apache Sling Discovery Base ........................ SUCCESS [01:16 min]
[INFO] Apache Sling Resource-Based Discovery Service ...... SUCCESS [03:05 min]
[INFO] Apache Sling Oak-Based Discovery Service ........... SUCCESS [02:41 min]
[INFO] Apache Sling Discovery Support Bundle .............. SUCCESS [  9.790 s]
[INFO] Apache Sling Discovery Standalone Implementation ... SUCCESS [ 10.507 s]
[INFO] Apache Sling Event Support ......................... SUCCESS [10:36 min]
[INFO] Apache Sling Feature Flags ......................... SUCCESS [  9.203 s]
[INFO] Apache Sling javax.activation bundle ............... SUCCESS [  9.389 s]
[INFO] Apache Sling Service User Mapper ................... SUCCESS [ 11.115 s]
[INFO] Apache Sling Settings .............................. SUCCESS [ 13.316 s]
[INFO] Apache Sling Web Console Branding .................. SUCCESS [  8.947 s]
[INFO] Apache Sling Web Console Security Provider ......... SUCCESS [  9.078 s]
[INFO] Apache Sling Explorer .............................. SUCCESS [ 10.078 s]
[INFO] Apache Sling Health Check Core ..................... SUCCESS [02:53 min]
[INFO] Apache Sling Health Check Samples .................. SUCCESS [ 18.304 s]
[INFO] Apache Sling Health Check Support Components ....... SUCCESS [ 11.252 s]
[INFO] Apache Sling Health Check Webconsole Plugin ........ SUCCESS [ 40.926 s]
[INFO] Apache Sling Health Check JUnit Bridge ............. SUCCESS [01:49 min]
[INFO] Apache Sling Health Check Annotations .............. SUCCESS [ 37.863 s]
[INFO] Apache Sling Health Check Integration Tests ........ SUCCESS [ 12.913 s]
[INFO] Apache Sling Health Check Reactor POM .............. SUCCESS [  6.332 s]
[INFO] Apache Sling Resource Access Security .............. SUCCESS [  9.585 s]
[INFO] Apache Sling Resource Access Security Integration Tests SUCCESS [ 41.994 s]
[INFO] Apache Sling Models API ............................ SUCCESS [  9.723 s]
[INFO] Apache Sling Models Implementation ................. SUCCESS [ 15.415 s]
[INFO] Apache Sling Models Integration Tests .............. SUCCESS [ 43.854 s]
[INFO] Apache Sling Internationalization Support .......... SUCCESS [01:04 min]
[INFO] Apache Sling XSS Protection Bundle ................. SUCCESS [ 24.368 s]
[INFO] Apache Sling JUnit Core ............................ SUCCESS [ 11.927 s]
[INFO] Apache Sling JUnit Tests Teleporter ................ SUCCESS [ 18.349 s]
[INFO] Apache Sling Resource Builder ...................... SUCCESS [ 43.991 s]
[INFO] Apache Sling Servlet Helpers ....................... SUCCESS [ 11.927 s]
[INFO] Apache Sling RepoInit Integration Tests ............ SUCCESS [ 40.421 s]
[INFO] Apache Sling RepoInit Reactor ...................... SUCCESS [  5.121 s]
[INFO] Apache Sling Test Tools ............................ SUCCESS [ 10.719 s]
[INFO] Apache Sling Testing Clients ....................... SUCCESS [ 17.365 s]
[INFO] Apache Sling Testing Hamcrest ...................... SUCCESS [ 10.547 s]
[INFO] Apache Sling Server Setup Tools .................... SUCCESS [ 12.482 s]
[INFO] Apache Sling Testing Rules ......................... SUCCESS [ 14.269 s]
[INFO] Apache Sling JUnit Scriptable Tests Provider ....... SUCCESS [ 11.210 s]
[INFO] Apache Sling JUnit Health Checks ................... SUCCESS [  9.740 s]
[INFO] Apache Sling JUnit Remote Tests Runners ............ SUCCESS [ 11.790 s]
[INFO] Apache Sling JUnit Performance ..................... SUCCESS [ 10.468 s]
[INFO] Apache Sling Testing Mock Log Configuration ........ SUCCESS [  9.141 s]
[INFO] Apache Sling Testing Resource Resolver Mock ........ SUCCESS [  9.891 s]
[INFO] Apache Sling Testing JCR Mock ...................... SUCCESS [ 13.259 s]
[INFO] Apache Sling Testing OSGi Mock ..................... SUCCESS [ 14.912 s]
[INFO] Apache Sling Testing Sling Mock .................... SUCCESS [ 31.219 s]
[INFO] Apache Sling Testing Sling Mock Oak-based Resource Resolver SUCCESS [01:11 min]
[INFO] Apache Sling Testing Mocks Modules Reactor ......... SUCCESS [  5.220 s]
[INFO] Apache Sling Testing - sample bundle with integration tests SUCCESS [ 47.794 s]
[INFO] Apache Sling Testing - sample module with integration tests SUCCESS [01:07 min]
[INFO] Apache Sling Testing Modules Reactor ............... FAILURE [  2.853 s]
[INFO] Apache Sling Installer ............................. SKIPPED
[INFO] Apache Sling File Installer ........................ SKIPPED
[INFO] Apache Sling JCR Installer ......................... SKIPPED
[INFO] Apache Sling Installer Configuration Admin Support . SKIPPED
[INFO] Apache Sling Deployment Package Installer .......... SKIPPED
[INFO] Apache Sling Subsystems Installer .................. SKIPPED
[INFO] Apache Sling Installer Integration Tests ........... SKIPPED
[INFO] Apache Sling Launchpad API ......................... SKIPPED
[INFO] Apache Sling Launchpad Installer ................... SKIPPED
[INFO] Apache Sling Launchpad Content ..................... SKIPPED
[INFO] Apache Sling Launchpad Testing Services ............ SKIPPED
[INFO] Apache Sling Launchpad Testing Services WAR ........ SKIPPED
[INFO] Apache Sling Launchpad Testing Fragment Bundle ..... SKIPPED
[INFO] Apache Sling Launchpad Test Bundles ................ SKIPPED
[INFO] Apache Sling Integration Tests ..................... SKIPPED
[INFO] Apache Sling Launchpad Testing ..................... SKIPPED
[INFO] Apache Sling (Builder) ............................. SKIPPED
[INFO] ------------------------------------------------------------------------
[INFO] BUILD FAILURE
[INFO] ------------------------------------------------------------------------
[INFO] Total time: 01:12 h
[INFO] Finished at: 2016-07-26T02:20:20+00:00

[INFO] Final Memory: 304M/458M
[INFO] ------------------------------------------------------------------------
Waiting for Jenkins to finish collecting data
[ERROR] Failed to execute goal org.apache.rat:apache-rat-plugin:0.11:check (default) on project
org.apache.sling.testing.reactor: Too many files with unapproved license: 1 See RAT report
in: <https://builds.apache.org/job/sling-trunk-1.7/ws/trunk/testing/target/rat.txt>
-> [Help 1]
[ERROR] 
[ERROR] To see the full stack trace of the errors, re-run Maven with the -e switch.
[ERROR] Re-run Maven using the -X switch to enable full debug logging.
[ERROR] 
[ERROR] For more information about the errors and possible solutions, please read the following
articles:
[ERROR] [Help 1] http://cwiki.apache.org/confluence/display/MAVEN/MojoFailureException
[ERROR] 
[ERROR] After correcting the problems, you can resume the build with the command
[ERROR]   mvn <goals> -rf :org.apache.sling.testing.reactor
channel stopped

Mime
View raw message