sling-commits mailing list archives

Site index · List index
Message view « Date » · « Thread »
Top « Date » · « Thread »
From Apache Jenkins Server <jenk...@builds.apache.org>
Subject Build failed in Jenkins: sling-trunk-1.7 #4242
Date Wed, 06 Jul 2016 19:02:19 GMT
See <https://builds.apache.org/job/sling-trunk-1.7/4242/>

------------------------------------------
[...truncated 12274 lines...]
A         testing/junit/core/src/main/resources
A         testing/junit/core/src/main/resources/OSGI-INF
A         testing/junit/core/src/main/resources/OSGI-INF/metatype
AU        testing/junit/core/src/main/resources/OSGI-INF/metatype/metatype.properties
AU        testing/junit/core/src/main/resources/junit.css
A         testing/junit/core/src/main/java
A         testing/junit/core/src/main/java/org
A         testing/junit/core/src/main/java/org/apache
A         testing/junit/core/src/main/java/org/apache/sling
A         testing/junit/core/src/main/java/org/apache/sling/junit
A         testing/junit/core/src/main/java/org/apache/sling/junit/RendererFactory.java
AU        testing/junit/core/src/main/java/org/apache/sling/junit/TestSelector.java
A         testing/junit/core/src/main/java/org/apache/sling/junit/SlingTestContext.java
A         testing/junit/core/src/main/java/org/apache/sling/junit/impl
AU        testing/junit/core/src/main/java/org/apache/sling/junit/impl/RendererSelectorImpl.java
AU        testing/junit/core/src/main/java/org/apache/sling/junit/impl/AnnotationsProcessor.java
AU        testing/junit/core/src/main/java/org/apache/sling/junit/impl/TestsManagerImpl.java
A         testing/junit/core/src/main/java/org/apache/sling/junit/impl/TestContextRunListenerWrapper.java
A         testing/junit/core/src/main/java/org/apache/sling/junit/impl/servlet
AU        testing/junit/core/src/main/java/org/apache/sling/junit/impl/servlet/XmlRenderer.java
AU        testing/junit/core/src/main/java/org/apache/sling/junit/impl/servlet/HtmlFilter.java
AU        testing/junit/core/src/main/java/org/apache/sling/junit/impl/servlet/HtmlRenderer.java
AU        testing/junit/core/src/main/java/org/apache/sling/junit/impl/servlet/SlingJUnitServlet.java
AU        testing/junit/core/src/main/java/org/apache/sling/junit/impl/servlet/JUnitServlet.java
A         testing/junit/core/src/main/java/org/apache/sling/junit/impl/servlet/JUnitResultRenderer.java
AU        testing/junit/core/src/main/java/org/apache/sling/junit/impl/servlet/PlainTextRenderer.java
AU        testing/junit/core/src/main/java/org/apache/sling/junit/impl/servlet/JsonRenderer.java
AU        testing/junit/core/src/main/java/org/apache/sling/junit/impl/servlet/JacocoServlet.java
AU        testing/junit/core/src/main/java/org/apache/sling/junit/impl/servlet/ServletProcessor.java
AU        testing/junit/core/src/main/java/org/apache/sling/junit/impl/servlet/TestLogServlet.java
AU        testing/junit/core/src/main/java/org/apache/sling/junit/impl/BundleTestsProvider.java
AU        testing/junit/core/src/main/java/org/apache/sling/junit/RequestParser.java
AU        testing/junit/core/src/main/java/org/apache/sling/junit/Renderer.java
AU        testing/junit/core/src/main/java/org/apache/sling/junit/TestObjectProcessor.java
AU        testing/junit/core/src/main/java/org/apache/sling/junit/RendererSelector.java
A         testing/junit/core/src/main/java/org/apache/sling/junit/rules
A         testing/junit/core/src/main/java/org/apache/sling/junit/rules/Service.java
A         testing/junit/core/src/main/java/org/apache/sling/junit/rules/ServerSideTeleporter.java
A         testing/junit/core/src/main/java/org/apache/sling/junit/rules/OSGiService.java
A         testing/junit/core/src/main/java/org/apache/sling/junit/rules/ServiceGetter.java
A         testing/junit/core/src/main/java/org/apache/sling/junit/rules/TeleporterRule.java
AU        testing/junit/core/src/main/java/org/apache/sling/junit/Activator.java
A         testing/junit/core/src/main/java/org/apache/sling/junit/SlingTestContextProvider.java
AU        testing/junit/core/src/main/java/org/apache/sling/junit/TestsManager.java
AU        testing/junit/core/src/main/java/org/apache/sling/junit/TestsProvider.java
A         testing/junit/core/src/main/java/org/apache/sling/junit/annotations
AU        testing/junit/core/src/main/java/org/apache/sling/junit/annotations/TestReference.java
AU        testing/junit/core/src/main/java/org/apache/sling/junit/annotations/AutoDetect.java
AU        testing/junit/core/src/main/java/org/apache/sling/junit/annotations/SlingAnnotationsTestRunner.java
AU        testing/junit/core/pom.xml
A         testing/junit/scriptable
A         testing/junit/scriptable/src
A         testing/junit/scriptable/src/main
A         testing/junit/scriptable/src/main/resources
A         testing/junit/scriptable/src/main/resources/SLING-INF
A         testing/junit/scriptable/src/main/resources/SLING-INF/nodetypes
AU        testing/junit/scriptable/src/main/resources/SLING-INF/nodetypes/slingtest.cnd
A         testing/junit/scriptable/src/main/java
A         testing/junit/scriptable/src/main/java/org
A         testing/junit/scriptable/src/main/java/org/apache
A         testing/junit/scriptable/src/main/java/org/apache/sling
A         testing/junit/scriptable/src/main/java/org/apache/sling/junit
A         testing/junit/scriptable/src/main/java/org/apache/sling/junit/scriptable
AU        testing/junit/scriptable/src/main/java/org/apache/sling/junit/scriptable/ExplainTests.java
AU        testing/junit/scriptable/src/main/java/org/apache/sling/junit/scriptable/ScriptableTestsProvider.java
AU        testing/junit/scriptable/src/main/java/org/apache/sling/junit/scriptable/HttpRequest.java
AU        testing/junit/scriptable/src/main/java/org/apache/sling/junit/scriptable/TestAllPaths.java
AU        testing/junit/scriptable/src/main/java/org/apache/sling/junit/scriptable/HttpResponse.java
AU        testing/junit/scriptable/src/main/java/org/apache/sling/junit/scriptable/TestServletOutputStream.java
A         testing/junit/scriptable/src/test
A         testing/junit/scriptable/src/test/java
A         testing/junit/scriptable/src/test/java/org
A         testing/junit/scriptable/src/test/java/org/apache
A         testing/junit/scriptable/src/test/java/org/apache/sling
A         testing/junit/scriptable/src/test/java/org/apache/sling/junit
A         testing/junit/scriptable/src/test/java/org/apache/sling/junit/tests
AU        testing/junit/scriptable/src/test/java/org/apache/sling/junit/tests/TestAllPathsTest.java
AU        testing/junit/scriptable/pom.xml
A         testing/junit/rules
A         testing/junit/rules/README.md
A         testing/junit/rules/src
A         testing/junit/rules/src/main
A         testing/junit/rules/src/main/java
A         testing/junit/rules/src/main/java/org
A         testing/junit/rules/src/main/java/org/apache
A         testing/junit/rules/src/main/java/org/apache/sling
A         testing/junit/rules/src/main/java/org/apache/sling/testing
A         testing/junit/rules/src/main/java/org/apache/sling/testing/junit
A         testing/junit/rules/src/main/java/org/apache/sling/testing/junit/rules
A         testing/junit/rules/src/main/java/org/apache/sling/testing/junit/rules/FilterRule.java
A         testing/junit/rules/src/main/java/org/apache/sling/testing/junit/rules/category
A         testing/junit/rules/src/main/java/org/apache/sling/testing/junit/rules/category/ClusterAwareTest.java
A         testing/junit/rules/src/main/java/org/apache/sling/testing/junit/rules/category/SlowRunningTest.java
A         testing/junit/rules/src/main/java/org/apache/sling/testing/junit/rules/category/FailingTest.java
A         testing/junit/rules/src/main/java/org/apache/sling/testing/junit/rules/category/FastRunningTest.java
A         testing/junit/rules/src/main/java/org/apache/sling/testing/junit/rules/category/SmokeTest.java
A         testing/junit/rules/src/main/java/org/apache/sling/testing/junit/rules/util
A         testing/junit/rules/src/main/java/org/apache/sling/testing/junit/rules/util/IgnoreTestsConfig.java
A         testing/junit/rules/src/main/java/org/apache/sling/testing/junit/rules/util/Match.java
A         testing/junit/rules/src/main/java/org/apache/sling/testing/junit/rules/util/Action.java
A         testing/junit/rules/src/main/java/org/apache/sling/testing/junit/rules/RunOnceRule.java
A         testing/junit/rules/src/main/java/org/apache/sling/testing/junit/rules/InstanceConfigRule.java
A         testing/junit/rules/src/main/java/org/apache/sling/testing/junit/rules/SlingRule.java
A         testing/junit/rules/src/main/java/org/apache/sling/testing/junit/rules/instance
A         testing/junit/rules/src/main/java/org/apache/sling/testing/junit/rules/instance/util
A         testing/junit/rules/src/main/java/org/apache/sling/testing/junit/rules/instance/util/ContextPathAllocator.java
A         testing/junit/rules/src/main/java/org/apache/sling/testing/junit/rules/instance/util/DirectoryAllocator.java
A         testing/junit/rules/src/main/java/org/apache/sling/testing/junit/rules/instance/util/Options.java
A         testing/junit/rules/src/main/java/org/apache/sling/testing/junit/rules/instance/util/ConfigurationPool.java
A         testing/junit/rules/src/main/java/org/apache/sling/testing/junit/rules/instance/ExistingInstance.java
A         testing/junit/rules/src/main/java/org/apache/sling/testing/junit/rules/instance/ExistingInstanceStatement.java
A         testing/junit/rules/src/main/java/org/apache/sling/testing/junit/rules/instance/Instance.java
A         testing/junit/rules/src/main/java/org/apache/sling/testing/junit/rules/instance/AbstractInstance.java
A         testing/junit/rules/src/main/java/org/apache/sling/testing/junit/rules/Condition.java
A         testing/junit/rules/src/main/java/org/apache/sling/testing/junit/rules/TestTimeout.java
A         testing/junit/rules/src/main/java/org/apache/sling/testing/junit/rules/TestStickyCookieRule.java
A         testing/junit/rules/src/main/java/org/apache/sling/testing/junit/rules/SlingInstanceRule.java
A         testing/junit/rules/src/main/java/org/apache/sling/testing/junit/rules/SlingClassRule.java
A         testing/junit/rules/src/main/java/org/apache/sling/testing/junit/rules/annotation
A         testing/junit/rules/src/main/java/org/apache/sling/testing/junit/rules/annotation/IgnoreIf.java
A         testing/junit/rules/src/main/java/org/apache/sling/testing/junit/rules/annotation/IgnoreIfProperty.java
A         testing/junit/rules/src/main/java/org/apache/sling/testing/junit/rules/annotation/Issue.java
A         testing/junit/rules/src/main/java/org/apache/sling/testing/junit/rules/annotation/Issues.java
A         testing/junit/rules/src/main/java/org/apache/sling/testing/junit/rules/annotation/IgnoreIfProperties.java
A         testing/junit/rules/src/main/java/org/apache/sling/testing/junit/rules/TestDescriptionRule.java
A         testing/junit/rules/src/test
A         testing/junit/rules/src/test/java
A         testing/junit/rules/src/test/java/org
A         testing/junit/rules/src/test/java/org/apache
A         testing/junit/rules/src/test/java/org/apache/sling
A         testing/junit/rules/src/test/java/org/apache/sling/testing
A         testing/junit/rules/src/test/java/org/apache/sling/testing/junit
A         testing/junit/rules/src/test/java/org/apache/sling/testing/junit/rules
A         testing/junit/rules/src/test/java/org/apache/sling/testing/junit/rules/util
A         testing/junit/rules/src/test/java/org/apache/sling/testing/junit/rules/util/UniquePathsTest.java
A         testing/junit/rules/src/test/java/org/apache/sling/testing/junit/rules/util/instanceconfig
A         testing/junit/rules/src/test/java/org/apache/sling/testing/junit/rules/util/instanceconfig/DebugInstanceConfig.java
A         testing/junit/rules/src/test/java/org/apache/sling/testing/junit/rules/util/instanceconfig/InstanceConfigRuleTest.java
A         testing/junit/rules/src/test/java/org/apache/sling/testing/junit/rules/util/filterrule
A         testing/junit/rules/src/test/java/org/apache/sling/testing/junit/rules/util/filterrule/FilterRuleIgnorelistSkipTest.java
A         testing/junit/rules/src/test/java/org/apache/sling/testing/junit/rules/util/filterrule/FilterRuleExcludeCategoryTest.java
A         testing/junit/rules/src/test/java/org/apache/sling/testing/junit/rules/util/filterrule/FilterRuleExcludeCategoryIgnoreIfTest.java
A         testing/junit/rules/src/test/java/org/apache/sling/testing/junit/rules/util/filterrule/FilterRuleIgnorelistTest.java
A         testing/junit/rules/src/test/java/org/apache/sling/testing/junit/rules/util/filterrule/FilterRuleTest.java
A         testing/junit/rules/src/test/java/org/apache/sling/testing/junit/rules/util/filterrule/FilterRuleIncludeCategoryTest.java
A         testing/junit/rules/src/test/java/org/apache/sling/testing/junit/rules/util/filterrule/FilterRuleAsteriskMatchTest.java
A         testing/junit/rules/src/test/java/org/apache/sling/testing/junit/rules/util/filterrule/FilterRuleDefaultTest.java
A         testing/junit/rules/src/test/java/org/apache/sling/testing/junit/rules/util/filterrule/FilterRuleIncludeCategoryIgnoreIfTest.java
A         testing/junit/rules/src/test/java/org/apache/sling/testing/junit/rules/util/poller
A         testing/junit/rules/src/test/java/org/apache/sling/testing/junit/rules/util/poller/AbstractPollerTest.java
A         testing/junit/rules/src/test/java/org/apache/sling/testing/junit/rules/util/RunOnceRuleTest.java
A         testing/junit/rules/pom.xml
A         testing/junit/remote
AU        testing/junit/remote/pom.xml
A         testing/junit/remote/src
A         testing/junit/remote/src/main
A         testing/junit/remote/src/main/java
A         testing/junit/remote/src/main/java/org
A         testing/junit/remote/src/main/java/org/apache
A         testing/junit/remote/src/main/java/org/apache/sling
A         testing/junit/remote/src/main/java/org/apache/sling/junit
A         testing/junit/remote/src/main/java/org/apache/sling/junit/remote
A         testing/junit/remote/src/main/java/org/apache/sling/junit/remote/ide
AU        testing/junit/remote/src/main/java/org/apache/sling/junit/remote/ide/ExecutionResult.java
AU        testing/junit/remote/src/main/java/org/apache/sling/junit/remote/ide/SerializedRenderer.java
AU        testing/junit/remote/src/main/java/org/apache/sling/junit/remote/ide/SlingRemoteExecutionRule.java
A         testing/junit/remote/src/main/java/org/apache/sling/junit/remote/ide/package-info.java
A         testing/junit/remote/src/main/java/org/apache/sling/junit/remote/testrunner
AU        testing/junit/remote/src/main/java/org/apache/sling/junit/remote/testrunner/SlingRemoteTestRunner.java
A         testing/junit/remote/src/main/java/org/apache/sling/junit/remote/testrunner/package-info.java
AU        testing/junit/remote/src/main/java/org/apache/sling/junit/remote/testrunner/SlingRemoteTest.java
AU        testing/junit/remote/src/main/java/org/apache/sling/junit/remote/testrunner/SlingRemoteTestParameters.java
AU        testing/junit/remote/src/main/java/org/apache/sling/junit/remote/testrunner/SlingTestsCountChecker.java
A         testing/junit/remote/src/main/java/org/apache/sling/junit/remote/testrunner/RemoteExecutionException.java
A         testing/junit/remote/src/main/java/org/apache/sling/junit/remote/exported
A         testing/junit/remote/src/main/java/org/apache/sling/junit/remote/exported/package-info.java
AU        testing/junit/remote/src/main/java/org/apache/sling/junit/remote/exported/ExampleRemoteTest.java
A         testing/junit/remote/src/main/java/org/apache/sling/junit/remote/httpclient
AU        testing/junit/remote/src/main/java/org/apache/sling/junit/remote/httpclient/RemoteTestHttpClient.java
A         testing/junit/remote/src/test
A         testing/junit/remote/src/test/java
A         testing/junit/remote/src/test/java/org
A         testing/junit/remote/src/test/java/org/apache
A         testing/junit/remote/src/test/java/org/apache/sling
A         testing/junit/remote/src/test/java/org/apache/sling/junit
A         testing/junit/remote/src/test/java/org/apache/sling/junit/remote
A         testing/junit/remote/src/test/java/org/apache/sling/junit/remote/testrunner
A         testing/junit/remote/src/test/java/org/apache/sling/junit/remote/testrunner/RemoteExecutionExceptionTest.java
AU        check_staged_release.sh
A         .mvn
A         .mvn/jvm.config
 U        .
At revision 1751720

No changes for http://svn.apache.org/repos/asf/sling/trunk since the previous build
Parsing POMs
Downloaded artifact http://repo.maven.apache.org/maven2/org/apache/apache/17/apache-17.pom
Downloaded artifact http://repo.maven.apache.org/maven2/org/apache/sling/sling/26/sling-26.pom
Downloaded artifact http://repo.maven.apache.org/maven2/org/apache/sling/sling/25/sling-25.pom
ERROR: Failed to parse POMs
java.io.IOException: remote file operation failed: <https://builds.apache.org/job/sling-trunk-1.7/ws/trunk>
at hudson.remoting.Channel@282b17c9:jenkins-test-877: hudson.remoting.ProxyException: hudson.maven.MavenModuleSetBuild$MavenExecutionException:
org.apache.maven.project.ProjectBuildingException: Some problems were encountered while processing
the POMs:
[FATAL] Non-resolvable parent POM: Could not find artifact org.apache.sling:sling:pom:27-SNAPSHOT
and 'parent.relativePath' points at no local POM @ line 24, column 11

	at hudson.FilePath.act(FilePath.java:986)
	at hudson.FilePath.act(FilePath.java:968)
	at hudson.maven.MavenModuleSetBuild$MavenModuleSetBuildExecution.parsePoms(MavenModuleSetBuild.java:960)
	at hudson.maven.MavenModuleSetBuild$MavenModuleSetBuildExecution.doRun(MavenModuleSetBuild.java:679)
	at hudson.model.AbstractBuild$AbstractBuildExecution.run(AbstractBuild.java:534)
	at hudson.model.Run.execute(Run.java:1738)
	at hudson.maven.MavenModuleSetBuild.run(MavenModuleSetBuild.java:531)
	at hudson.model.ResourceController.execute(ResourceController.java:98)
	at hudson.model.Executor.run(Executor.java:410)
Caused by: hudson.remoting.ProxyException: hudson.maven.MavenModuleSetBuild$MavenExecutionException:
org.apache.maven.project.ProjectBuildingException: Some problems were encountered while processing
the POMs:
[FATAL] Non-resolvable parent POM: Could not find artifact org.apache.sling:sling:pom:27-SNAPSHOT
and 'parent.relativePath' points at no local POM @ line 24, column 11

	at hudson.maven.MavenModuleSetBuild$PomParser.invoke(MavenModuleSetBuild.java:1364)
	at hudson.maven.MavenModuleSetBuild$PomParser.invoke(MavenModuleSetBuild.java:1098)
	at hudson.FilePath$FileCallableWrapper.call(FilePath.java:2719)
	at hudson.remoting.UserRequest.perform(UserRequest.java:120)
	at hudson.remoting.UserRequest.perform(UserRequest.java:48)
	at hudson.remoting.Request$2.run(Request.java:326)
	at hudson.remoting.InterceptingExecutorService$1.call(InterceptingExecutorService.java:68)
	at java.util.concurrent.FutureTask.run(FutureTask.java:262)
	at java.util.concurrent.ThreadPoolExecutor.runWorker(ThreadPoolExecutor.java:1145)
	at java.util.concurrent.ThreadPoolExecutor$Worker.run(ThreadPoolExecutor.java:615)
	at java.lang.Thread.run(Thread.java:745)
	at ......remote call to jenkins-test-877(Native Method)
	at hudson.remoting.Channel.attachCallSiteStackTrace(Channel.java:1416)
	at hudson.remoting.UserResponse.retrieve(UserRequest.java:220)
	at hudson.remoting.Channel.call(Channel.java:781)
	at hudson.FilePath.act(FilePath.java:979)
	... 8 more
Caused by: hudson.remoting.ProxyException: org.apache.maven.project.ProjectBuildingException:
Some problems were encountered while processing the POMs:
[FATAL] Non-resolvable parent POM: Could not find artifact org.apache.sling:sling:pom:27-SNAPSHOT
and 'parent.relativePath' points at no local POM @ line 24, column 11

	at org.apache.maven.project.DefaultProjectBuilder.build(DefaultProjectBuilder.java:364)
	at hudson.maven.MavenEmbedder.buildProjects(MavenEmbedder.java:361)
	at hudson.maven.MavenEmbedder.readProjects(MavenEmbedder.java:331)
	at hudson.maven.MavenModuleSetBuild$PomParser.invoke(MavenModuleSetBuild.java:1301)
	at hudson.maven.MavenModuleSetBuild$PomParser.invoke(MavenModuleSetBuild.java:1098)
	at hudson.FilePath$FileCallableWrapper.call(FilePath.java:2719)
	at hudson.remoting.UserRequest.perform(UserRequest.java:120)
	at hudson.remoting.UserRequest.perform(UserRequest.java:48)
	at hudson.remoting.Request$2.run(Request.java:326)
	at hudson.remoting.InterceptingExecutorService$1.call(InterceptingExecutorService.java:68)
	at java.util.concurrent.FutureTask.run(FutureTask.java:262)
	at java.util.concurrent.ThreadPoolExecutor.runWorker(ThreadPoolExecutor.java:1145)
	at java.util.concurrent.ThreadPoolExecutor$Worker.run(ThreadPoolExecutor.java:615)
	at java.lang.Thread.run(Thread.java:745)

Mime
View raw message