sling-commits mailing list archives

Site index · List index
Message view « Date » · « Thread »
Top « Date » · « Thread »
From Apache Jenkins Server <jenk...@builds.apache.org>
Subject Build failed in Jenkins: sling-trunk-1.8 #3491
Date Wed, 06 Jul 2016 14:51:45 GMT
See <https://builds.apache.org/job/sling-trunk-1.8/3491/changes>

Changes:

[bdelacretaz] SLING-5682 - add tests for createPrincipal* methods, contributed by Nicolas
Peltier, thanks!

------------------------------------------
[...truncated 111143 lines...]
[INFO] Apache Sling Scripting Sightly JavaScript Use Provider  SUCCESS [4.232s]
[INFO] Apache Sling Scripting Sightly Models Use Provider  SUCCESS [2.661s]
[INFO] Apache Sling Scripting Sightly Read-Eval-Print Loop Environment  SUCCESS [2.922s]
[INFO] Apache Sling Scripting Sightly Integration Tests Content  SUCCESS [4.113s]
[INFO] Apache Sling Launchpad Base ....................... SUCCESS [18.150s]
[INFO] Apache Sling Subsystems Base Installer ............ SUCCESS [5.704s]
[INFO] Apache Sling Filesystem Resource Provider ......... SUCCESS [4.717s]
[INFO] Apache Sling Installer WebConsole Plugin .......... SUCCESS [4.055s]
[INFO] Apache Sling Launchpad Application Builder ........ SUCCESS [24.180s]
[INFO] Apache Sling Scripting Sightly Integration Tests .. SUCCESS [2:16.899s]
[INFO] Apache Sling Scripting Sightly Reactor ............ SUCCESS [1.219s]
[INFO] Apache Sling Adapter Manager Implementation ....... SUCCESS [5.849s]
[INFO] Apache Sling Bundle Resource Provider ............. SUCCESS [3.309s]
[INFO] Apache Sling Distributed Event Admin .............. SUCCESS [5.226s]
[INFO] Apache Sling Discovery API ........................ SUCCESS [2.144s]
[INFO] Apache Sling Discovery Commons .................... SUCCESS [1:08.780s]
[INFO] Apache Sling Discovery Base ....................... SUCCESS [1:14.091s]
[INFO] Apache Sling Resource-Based Discovery Service ..... SUCCESS [3:23.964s]
[INFO] Apache Sling Oak-Based Discovery Service .......... SUCCESS [2:37.140s]
[INFO] Apache Sling Discovery Support Bundle ............. SUCCESS [5.015s]
[INFO] Apache Sling Discovery Standalone Implementation .. SUCCESS [3.738s]
[INFO] Apache Sling Event Support ........................ SUCCESS [26:38.943s]
[INFO] Apache Sling Feature Flags ........................ SUCCESS [4.238s]
[INFO] Apache Sling javax.activation bundle .............. SUCCESS [4.393s]
[INFO] Apache Sling Service User Mapper .................. SUCCESS [8.929s]
[INFO] Apache Sling Settings ............................. SUCCESS [3.993s]
[INFO] Apache Sling Web Console Branding ................. SUCCESS [1.876s]
[INFO] Apache Sling Web Console Security Provider ........ SUCCESS [2.043s]
[INFO] Apache Sling Explorer ............................. SUCCESS [5.605s]
[INFO] Apache Sling Health Check Core .................... SUCCESS [2:01.959s]
[INFO] Apache Sling Health Check Samples ................. SUCCESS [3.668s]
[INFO] Apache Sling Health Check Support Components ...... SUCCESS [8.391s]
[INFO] Apache Sling Health Check Webconsole Plugin ....... SUCCESS [3.002s]
[INFO] Apache Sling Health Check JUnit Bridge ............ SUCCESS [4.621s]
[INFO] Apache Sling Health Check Annotations ............. SUCCESS [2.970s]
[INFO] Apache Sling Health Check Integration Tests ....... SUCCESS [7.705s]
[INFO] Apache Sling Health Check Reactor POM ............. SUCCESS [1.201s]
[INFO] Apache Sling Resource Access Security ............. SUCCESS [3.519s]
[INFO] Apache Sling Resource Access Security Integration Tests  SUCCESS [50.723s]
[INFO] Apache Sling Models API ........................... SUCCESS [2.713s]
[INFO] Apache Sling Models Implementation ................ SUCCESS [7.199s]
[INFO] Apache Sling Models Integration Tests ............. SUCCESS [54.331s]
[INFO] Apache Sling Internationalization Support ......... SUCCESS [1:32.540s]
[INFO] Apache Sling XSS Protection Bundle ................ SUCCESS [13.209s]
[INFO] Apache Sling JUnit Core ........................... SUCCESS [4.030s]
[INFO] Apache Sling JUnit Tests Teleporter ............... SUCCESS [12.042s]
[INFO] Apache Sling Resource Builder ..................... SUCCESS [25.542s]
[INFO] Apache Sling Servlet Helpers ...................... SUCCESS [4.768s]
[INFO] Apache Sling RepoInit Parser ...................... SUCCESS [3.853s]
[INFO] Apache Sling RepoInit JCR module .................. FAILURE [0.704s]
[INFO] Apache Sling RepoInit Integration Tests ........... SKIPPED
[INFO] Apache Sling RepoInit Reactor ..................... SKIPPED
[INFO] Apache Sling Test Tools ........................... SKIPPED
[INFO] Apache Sling Testing Clients ...................... SKIPPED
[INFO] Apache Sling Testing Hamcrest ..................... SKIPPED
[INFO] Apache Sling Server Setup Tools ................... SKIPPED
[INFO] Apache Sling Testing Rules ........................ SKIPPED
[INFO] Apache Sling JUnit Scriptable Tests Provider ...... SKIPPED
[INFO] Apache Sling JUnit Health Checks .................. SKIPPED
[INFO] Apache Sling JUnit Remote Tests Runners ........... SKIPPED
[INFO] Apache Sling JUnit Performance .................... SKIPPED
[INFO] Apache Sling Testing Mock Log Configuration ....... SKIPPED
[INFO] Apache Sling Testing Resource Resolver Mock ....... SKIPPED
[INFO] Apache Sling Testing JCR Mock ..................... SKIPPED
[INFO] Apache Sling Testing OSGi Mock .................... SKIPPED
[INFO] Apache Sling Testing Sling Mock ................... SKIPPED
[INFO] Apache Sling Testing Sling Mock Oak-based Resource Resolver  SKIPPED
[INFO] Apache Sling Testing Mocks Modules Reactor ........ SKIPPED
[INFO] Apache Sling Testing - sample bundle with integration tests  SKIPPED
[INFO] Apache Sling Testing - sample module with integration tests  SKIPPED
[INFO] Apache Sling Testing PaxExam ...................... SKIPPED
[INFO] Apache Sling Testing Modules Reactor .............. SKIPPED
[INFO] Apache Sling Installer ............................ SKIPPED
[INFO] Apache Sling File Installer ....................... SKIPPED
[INFO] Apache Sling JCR Installer ........................ SKIPPED
[INFO] Apache Sling Installer Configuration Admin Support  SKIPPED
[INFO] Apache Sling Deployment Package Installer ......... SKIPPED
[INFO] Apache Sling Subsystems Installer ................. SKIPPED
[INFO] Apache Sling Installer Integration Tests .......... SKIPPED
[INFO] Apache Sling Launchpad API ........................ SKIPPED
[INFO] Apache Sling Launchpad Installer .................. SKIPPED
[INFO] Apache Sling Launchpad Content .................... SKIPPED
[INFO] Apache Sling Validation Framework API ............. SKIPPED
[INFO] Apache Sling Validation Framework Core Implementation  SKIPPED
[INFO] Apache Sling Validation Framework Testing Services  SKIPPED
[INFO] Apache Sling Validation Framework Integration Tests  SKIPPED
[INFO] Apache Sling Validation Framework Examples ........ SKIPPED
[INFO] Apache Sling Validation Framework Builder ......... SKIPPED
[INFO] Apache Sling Models Validation Implementation ..... SKIPPED
[INFO] Apache Sling (Builder) ............................ SKIPPED
[INFO] ------------------------------------------------------------------------
[INFO] BUILD FAILURE
[INFO] ------------------------------------------------------------------------
[INFO] Total time: 1:04:00.083s
[INFO] Finished at: Wed Jul 06 14:48:40 UTC 2016
[INFO] Final Memory: 199M/403M
[INFO] ------------------------------------------------------------------------
[JENKINS] Archiving disabled
[JENKINS] Archiving disabled
[JENKINS] Archiving disabled
[JENKINS] Archiving disabled
[JENKINS] Archiving disabled
[JENKINS] Archiving disabled
[JENKINS] Archiving disabled
[JENKINS] Archiving disabled
[JENKINS] Archiving disabled
[JENKINS] Archiving disabled
[JENKINS] Archiving disabled
[JENKINS] Archiving disabled
[JENKINS] Archiving disabled
[JENKINS] Archiving disabled
[JENKINS] Archiving disabled
[JENKINS] Archiving disabled
[JENKINS] Archiving disabled
[JENKINS] Archiving disabled
[JENKINS] Archiving disabled
[JENKINS] Archiving disabled
[JENKINS] Archiving disabled
[JENKINS] Archiving disabled
[JENKINS] Archiving disabled
[JENKINS] Archiving disabled
[JENKINS] Archiving disabled
[JENKINS] Archiving disabled
[JENKINS] Archiving disabled
[JENKINS] Archiving disabled
[JENKINS] Archiving disabled
[JENKINS] Archiving disabled
[JENKINS] Archiving disabled
[JENKINS] Archiving disabled
[JENKINS] Archiving disabled
[JENKINS] Archiving disabled
[JENKINS] Archiving disabled
[JENKINS] Archiving disabled
[JENKINS] Archiving disabled
[JENKINS] Archiving disabled
[JENKINS] Archiving disabled
[JENKINS] Archiving disabled
[JENKINS] Archiving disabled
[JENKINS] Archiving disabled
[JENKINS] Archiving disabled
[JENKINS] Archiving disabled
[JENKINS] Archiving disabled
[JENKINS] Archiving disabled
[JENKINS] Archiving disabled
[JENKINS] Archiving disabled
[JENKINS] Archiving disabled
[JENKINS] Archiving disabled
[JENKINS] Archiving disabled
[JENKINS] Archiving disabled
[JENKINS] Archiving disabled
[JENKINS] Archiving disabled
[JENKINS] Archiving disabled
[JENKINS] Archiving disabled
[JENKINS] Archiving disabled
[JENKINS] Archiving disabled
[JENKINS] Archiving disabled
[JENKINS] Archiving disabled
[JENKINS] Archiving disabled
[JENKINS] Archiving disabled
[JENKINS] Archiving disabled
[JENKINS] Archiving disabled
[JENKINS] Archiving disabled
[JENKINS] Archiving disabled
[JENKINS] Archiving disabled
[JENKINS] Archiving disabled
[JENKINS] Archiving disabled
[JENKINS] Archiving disabled
[JENKINS] Archiving disabled
[JENKINS] Archiving disabled
[JENKINS] Archiving disabled
[JENKINS] Archiving disabled
[JENKINS] Archiving disabled
[JENKINS] Archiving disabled
[JENKINS] Archiving disabled
[JENKINS] Archiving disabled
[JENKINS] Archiving disabled
[JENKINS] Archiving disabled
[JENKINS] Archiving disabled
[JENKINS] Archiving disabled
[JENKINS] Archiving disabled
[JENKINS] Archiving disabled
[JENKINS] Archiving disabled
[JENKINS] Archiving disabled
[JENKINS] Archiving disabled
[JENKINS] Archiving disabled
[JENKINS] Archiving disabled
[JENKINS] Archiving disabled
[JENKINS] Archiving disabled
[JENKINS] Archiving disabled
[JENKINS] Archiving disabled
[JENKINS] Archiving disabled
[JENKINS] Archiving disabled
[JENKINS] Archiving disabled
[JENKINS] Archiving disabled
[JENKINS] Archiving disabled
[JENKINS] Archiving disabled
[JENKINS] Archiving disabled
[JENKINS] Archiving disabled
[JENKINS] Archiving disabled
[JENKINS] Archiving disabled
[JENKINS] Archiving disabled
[JENKINS] Archiving disabled
[JENKINS] Archiving disabled
[JENKINS] Archiving disabled
[JENKINS] Archiving disabled
[JENKINS] Archiving disabled
[JENKINS] Archiving disabled
[JENKINS] Archiving disabled
[JENKINS] Archiving disabled
[JENKINS] Archiving disabled
[JENKINS] Archiving disabled
[JENKINS] Archiving disabled
[JENKINS] Archiving disabled
[JENKINS] Archiving disabled
[JENKINS] Archiving disabled
[JENKINS] Archiving disabled
[JENKINS] Archiving disabled
[JENKINS] Archiving disabled
[JENKINS] Archiving disabled
[JENKINS] Archiving disabled
[JENKINS] Archiving disabled
[JENKINS] Archiving disabled
[JENKINS] Archiving disabled
[JENKINS] Archiving disabled
[JENKINS] Archiving disabled
[JENKINS] Archiving disabled
[JENKINS] Archiving disabled
[JENKINS] Archiving disabled
[JENKINS] Archiving disabled
[JENKINS] Archiving disabled
[JENKINS] Archiving disabled
[JENKINS] Archiving disabled
[JENKINS] Archiving disabled
[JENKINS] Archiving disabled
[JENKINS] Archiving disabled
[JENKINS] Archiving disabled
[JENKINS] Archiving disabled
Waiting for Jenkins to finish collecting data
[ERROR] Failed to execute goal on project org.apache.sling.jcr.repoinit: Could not resolve
dependencies for project org.apache.sling:org.apache.sling.jcr.repoinit:bundle:1.0.1-SNAPSHOT:
Could not find artifact org.apache.sling:org.apache.sling.repoinit.parser:jar:1.0.2 in central
(http://repo.maven.apache.org/maven2) -> [Help 1]
[ERROR] 
[ERROR] To see the full stack trace of the errors, re-run Maven with the -e switch.
[ERROR] Re-run Maven using the -X switch to enable full debug logging.
[ERROR] 
[ERROR] For more information about the errors and possible solutions, please read the following
articles:
[ERROR] [Help 1] http://cwiki.apache.org/confluence/display/MAVEN/DependencyResolutionException
[ERROR] 
[ERROR] After correcting the problems, you can resume the build with the command
[ERROR]   mvn <goals> -rf :org.apache.sling.jcr.repoinit
channel stopped

Mime
View raw message