sling-commits mailing list archives

Site index · List index
Message view « Date » · « Thread »
Top « Date » · « Thread »
From Apache Jenkins Server <jenk...@builds.apache.org>
Subject Build failed in Jenkins: sling-trunk-1.7 #4355
Date Mon, 25 Jul 2016 08:10:36 GMT
See <https://builds.apache.org/job/sling-trunk-1.7/4355/>

------------------------------------------
[...truncated 118712 lines...]
[JENKINS] Archiving disabled
[JENKINS] Archiving disabled
[JENKINS] Archiving disabled
[JENKINS] Archiving disabled
[JENKINS] Archiving disabled
[JENKINS] Archiving disabled
[JENKINS] Archiving disabled
[JENKINS] Archiving disabled
[JENKINS] Archiving disabled
[JENKINS] Archiving disabled
[JENKINS] Archiving disabled
[JENKINS] Archiving disabled
[JENKINS] Archiving disabled
[JENKINS] Archiving disabled
[JENKINS] Archiving disabled
[JENKINS] Archiving disabled
[JENKINS] Archiving disabled
[JENKINS] Archiving disabled
[JENKINS] Archiving disabled
[JENKINS] Archiving disabled
[JENKINS] Archiving disabled
[JENKINS] Archiving disabled
[JENKINS] Archiving disabled
[JENKINS] Archiving disabled
[JENKINS] Archiving disabled
[JENKINS] Archiving disabled
[JENKINS] Archiving disabled
[JENKINS] Archiving disabled
[JENKINS] Archiving disabled
[JENKINS] Archiving disabled
[JENKINS] Archiving disabled
[JENKINS] Archiving disabled
[JENKINS] Archiving disabled
[JENKINS] Archiving disabled
[JENKINS] Archiving disabled
[JENKINS] Archiving disabled
[JENKINS] Archiving disabled
[JENKINS] Archiving disabled
[JENKINS] Archiving disabled
[JENKINS] Archiving disabled
[JENKINS] Archiving disabled
[JENKINS] Archiving disabled
[JENKINS] Archiving disabled
[JENKINS] Archiving disabled
[JENKINS] Archiving disabled
[JENKINS] Archiving disabled
[JENKINS] Archiving disabled
[JENKINS] Archiving disabled
[JENKINS] Archiving disabled
[JENKINS] Archiving disabled
[JENKINS] Archiving disabled
[JENKINS] Archiving disabled
[JENKINS] Archiving disabled
[JENKINS] Archiving disabled
[JENKINS] Archiving disabled
[JENKINS] Archiving disabled
[JENKINS] Archiving disabled
[JENKINS] Archiving disabled
[JENKINS] Archiving disabled
[JENKINS] Archiving disabled
[JENKINS] Archiving disabled
[JENKINS] Archiving disabled
[JENKINS] Archiving disabled
[JENKINS] Archiving disabled
[JENKINS] Archiving disabled
[JENKINS] Archiving disabled
[JENKINS] Archiving disabled
[JENKINS] Archiving disabled
[JENKINS] Archiving disabled
[JENKINS] Archiving disabled
[JENKINS] Archiving disabled
[JENKINS] Archiving disabled
[JENKINS] Archiving disabled
[JENKINS] Archiving disabled
[JENKINS] Archiving disabled
[JENKINS] Archiving disabled
[JENKINS] Archiving disabled
[JENKINS] Archiving disabled
[JENKINS] Archiving disabled
[JENKINS] Archiving disabled
[JENKINS] Archiving disabled[INFO] ------------------------------------------------------------------------
[INFO] Reactor Summary:
[INFO] 
[INFO] Apache Sling JAR Resource Bundle ................... SUCCESS [  9.162 s]
[INFO] Apache Sling (Parent) .............................. SUCCESS [  8.716 s]
[INFO] Apache Sling Tooling Support Install ............... SUCCESS [ 14.192 s]
[INFO] Apache Sling Provisioning Model .................... SUCCESS [ 34.606 s]
[INFO] Apache Sling Tooling Support Source ................ SUCCESS [ 10.450 s]
[INFO] Apache Sling Testing Utilities ..................... SUCCESS [ 50.140 s]
[INFO] Apache Sling API ................................... SUCCESS [ 23.458 s]
[INFO] Apache Sling Resource Resolver ..................... SUCCESS [ 19.195 s]
[INFO] Apache Sling System Bundle Extension: Java Transaction API SUCCESS [ 10.456 s]
[INFO] Apache Sling System Bundle Extension: XML APIs ..... SUCCESS [ 17.887 s]
[INFO] Apache Sling System Bundle Extension: Activation API SUCCESS [ 20.166 s]
[INFO] Apache Sling System Bundle Extension: WS APIs ...... SUCCESS [  9.248 s]
[INFO] Apache Sling Dynamic Class Loader Support .......... SUCCESS [ 17.688 s]
[INFO] Apache Sling Commons FileSystem ClassLoader ........ SUCCESS [ 11.195 s]
[INFO] Apache Sling Commons Java Compiler ................. SUCCESS [ 29.848 s]
[INFO] Apache Sling JSON Library .......................... SUCCESS [ 16.187 s]
[INFO] Apache Sling SLF4J Implementation (Logback) ........ SUCCESS [01:06 min]
[INFO] Apache Sling OSGi LogService Implementation ........ SUCCESS [ 10.767 s]
[INFO] Apache Sling MIME type mapping support ............. SUCCESS [ 11.491 s]
[INFO] Apache Sling Content Detection Support ............. SUCCESS [01:09 min]
[INFO] Apache Sling Commons OSGi support .................. SUCCESS [ 15.448 s]
[INFO] Apache Sling Scheduler Support ..................... SUCCESS [ 16.401 s]
[INFO] Apache Sling Thread Dumper ......................... SUCCESS [  9.336 s]
[INFO] Apache Sling Thread Support ........................ SUCCESS [ 12.847 s]
[INFO] Apache Sling Metrics ............................... SUCCESS [ 14.237 s]
[INFO] Apache Sling Authentication Service ................ SUCCESS [ 11.294 s]
[INFO] Apache Sling Form Based Authentication Handler ..... SUCCESS [ 14.307 s]
[INFO] Apache Sling Engine Implementation ................. SUCCESS [ 18.564 s]
[INFO] Apache Sling Repository API Bundle ................. SUCCESS [  9.204 s]
[INFO] Apache Sling JCR Base Bundle ....................... SUCCESS [ 12.247 s]
[INFO] Apache Sling Pax Exam Utilities .................... SUCCESS [01:09 min]
[INFO] Apache Sling Initial Content Loader ................ SUCCESS [02:12 min]
[INFO] Apache Sling Jackrabbit Embedded Repository ........ SUCCESS [ 32.482 s]
[INFO] Apache Sling Jackrabbit UserManager Support ........ SUCCESS [ 10.427 s]
[INFO] Apache Sling Jackrabbit JSR-283 Access Control Manager Support SUCCESS [ 20.640 s]
[INFO] Apache Sling Wrapper Bundle for the JCR API ........ SUCCESS [ 18.998 s]
[INFO] Apache Sling JCR Resource Resolver ................. SUCCESS [01:14 min]
[INFO] Apache Sling Versioning Integration Tests .......... SUCCESS [ 38.016 s]
[INFO] Apache Sling JCR Repository Registration ........... SUCCESS [ 13.381 s]
[INFO] Apache Sling Simple WebDAV Access to repositories .. SUCCESS [ 39.038 s]
[INFO] Apache Sling DavEx Access to repositories .......... SUCCESS [ 12.125 s]
[INFO] Apache Sling JCR WebConsole Bundle ................. SUCCESS [  9.391 s]
[INFO] Apache Sling Oak Repository Server ................. SUCCESS [ 16.747 s]
[INFO] Apache Sling SlingRepository Integration Tests ..... SUCCESS [01:58 min]
[INFO] Apache Sling RepoInit Parser ....................... SUCCESS [ 11.446 s]
[INFO] Apache Sling RepoInit JCR module ................... SUCCESS [ 42.852 s]
[INFO] Apache Sling Servlet Resolver ...................... SUCCESS [ 11.680 s]
[INFO] Apache Sling Default GET Servlets .................. SUCCESS [ 14.257 s]
[INFO] Apache Sling Default POST Servlets ................. SUCCESS [ 13.385 s]
[INFO] Apache Sling Compat Servlets ....................... SUCCESS [ 13.743 s]
[INFO] Apache Sling Scripting Implementation API .......... SUCCESS [ 37.095 s]
[INFO] Apache Sling Scripting Core implementation ......... SUCCESS [ 27.931 s]
[INFO] Apache Sling Scripting JavaScript Support .......... SUCCESS [ 49.314 s]
[INFO] Apache Sling Scripting JSP Support ................. SUCCESS [ 15.714 s]
[INFO] Apache Sling JSP Tag Library ....................... SUCCESS [ 17.698 s]
[INFO] Apache Sling JSP Standard Tag Library .............. SUCCESS [ 19.544 s]
[INFO] Apache Sling Scripting Sightly Compiler ............ SUCCESS [ 38.885 s]
[INFO] Apache Sling Scripting Sightly Java Compiler ....... SUCCESS [ 39.908 s]
[INFO] Apache Sling Scripting Sightly Engine .............. SUCCESS [ 27.137 s]
[INFO] Apache Sling Scripting Sightly JavaScript Use Provider SUCCESS [ 10.383 s]
[INFO] Apache Sling Scripting Sightly Models Use Provider . SUCCESS [ 10.390 s]
[INFO] Apache Sling Scripting Sightly Read-Eval-Print Loop Environment SUCCESS [ 40.198 s]
[INFO] Apache Sling Scripting Sightly Integration Tests Content SUCCESS [ 13.432 s]
[INFO] Apache Sling Launchpad Base ........................ SUCCESS [ 43.311 s]
[INFO] Apache Sling Subsystems Base Installer ............. SUCCESS [ 12.474 s]
[INFO] Apache Sling Filesystem Resource Provider .......... SUCCESS [  9.504 s]
[INFO] Apache Sling Installer WebConsole Plugin ........... SUCCESS [  9.089 s]
[INFO] Apache Sling Launchpad Application Builder ......... SUCCESS [01:20 min]
[INFO] Apache Sling Scripting Sightly Integration Tests ... SUCCESS [05:39 min]
[INFO] Apache Sling Scripting Sightly Reactor ............. SUCCESS [  5.344 s]
[INFO] Apache Sling Adapter Manager Implementation ........ SUCCESS [ 10.495 s]
[INFO] Apache Sling Bundle Resource Provider .............. SUCCESS [ 10.938 s]
[INFO] Apache Sling Distributed Event Admin ............... SUCCESS [ 21.397 s]
[INFO] Apache Sling Discovery API ......................... SUCCESS [ 17.713 s]
[INFO] Apache Sling Discovery Commons ..................... SUCCESS [01:13 min]
[INFO] Apache Sling Discovery Base ........................ SUCCESS [01:28 min]
[INFO] Apache Sling Resource-Based Discovery Service ...... SUCCESS [03:43 min]
[INFO] Apache Sling Oak-Based Discovery Service ........... SUCCESS [02:43 min]
[INFO] Apache Sling Discovery Support Bundle .............. SUCCESS [  9.390 s]
[INFO] Apache Sling Discovery Standalone Implementation ... SUCCESS [  9.911 s]
[INFO] Apache Sling Event Support ......................... SUCCESS [13:28 min]
[INFO] Apache Sling Feature Flags ......................... SUCCESS [  9.714 s]
[INFO] Apache Sling javax.activation bundle ............... SUCCESS [  9.964 s]
[INFO] Apache Sling Service User Mapper ................... SUCCESS [ 10.564 s]
[INFO] Apache Sling Settings .............................. SUCCESS [ 10.715 s]
[INFO] Apache Sling Web Console Branding .................. SUCCESS [  9.134 s]
[INFO] Apache Sling Web Console Security Provider ......... SUCCESS [  9.605 s]
[INFO] Apache Sling Explorer .............................. SUCCESS [  9.858 s]
[INFO] Apache Sling Health Check Core ..................... SUCCESS [02:52 min]
[INFO] Apache Sling Health Check Samples .................. SUCCESS [ 11.746 s]
[INFO] Apache Sling Health Check Support Components ....... SUCCESS [ 10.512 s]
[INFO] Apache Sling Health Check Webconsole Plugin ........ SUCCESS [  9.867 s]
[INFO] Apache Sling Health Check JUnit Bridge ............. SUCCESS [ 11.020 s]
[INFO] Apache Sling Health Check Annotations .............. SUCCESS [  8.496 s]
[INFO] Apache Sling Health Check Integration Tests ........ SUCCESS [ 14.843 s]
[INFO] Apache Sling Health Check Reactor POM .............. SUCCESS [  5.103 s]
[INFO] Apache Sling Resource Access Security .............. SUCCESS [ 10.603 s]
[INFO] Apache Sling Resource Access Security Integration Tests SUCCESS [01:00 min]
[INFO] Apache Sling Models API ............................ SUCCESS [  9.854 s]
[INFO] Apache Sling Models Implementation ................. SUCCESS [ 14.927 s]
[INFO] Apache Sling Models Integration Tests .............. SUCCESS [01:04 min]
[INFO] Apache Sling Internationalization Support .......... SUCCESS [01:43 min]
[INFO] Apache Sling XSS Protection Bundle ................. SUCCESS [ 22.004 s]
[INFO] Apache Sling JUnit Core ............................ SUCCESS [ 11.934 s]
[INFO] Apache Sling JUnit Tests Teleporter ................ SUCCESS [ 17.703 s]
[INFO] Apache Sling Resource Builder ...................... SUCCESS [ 58.829 s]
[INFO] Apache Sling Servlet Helpers ....................... SUCCESS [ 10.819 s]
[INFO] Apache Sling RepoInit Integration Tests ............ SUCCESS [ 40.701 s]
[INFO] Apache Sling RepoInit Reactor ...................... SUCCESS [  5.491 s]
[INFO] Apache Sling Test Tools ............................ SUCCESS [ 11.125 s]
[INFO] Apache Sling Testing Clients ....................... SUCCESS [ 17.228 s]
[INFO] Apache Sling Testing Hamcrest ...................... SUCCESS [ 10.129 s]
[INFO] Apache Sling Server Setup Tools .................... SUCCESS [ 11.852 s]
[INFO] Apache Sling Testing Rules ......................... SUCCESS [ 15.122 s]
[INFO] Apache Sling JUnit Scriptable Tests Provider ....... SUCCESS [ 10.615 s]
[INFO] Apache Sling JUnit Health Checks ................... SUCCESS [  9.891 s]
[INFO] Apache Sling JUnit Remote Tests Runners ............ SUCCESS [ 13.878 s]
[INFO] Apache Sling JUnit Performance ..................... SUCCESS [ 10.438 s]
[INFO] Apache Sling Testing Mock Log Configuration ........ SUCCESS [  9.465 s]
[INFO] Apache Sling Testing Resource Resolver Mock ........ SUCCESS [ 11.396 s]
[INFO] Apache Sling Testing JCR Mock ...................... SUCCESS [ 11.093 s]
[INFO] Apache Sling Testing OSGi Mock ..................... SUCCESS [ 12.818 s]
[INFO] Apache Sling Testing Sling Mock .................... SUCCESS [ 22.765 s]
[INFO] Apache Sling Testing Sling Mock Oak-based Resource Resolver SUCCESS [01:26 min]
[INFO] Apache Sling Testing Mocks Modules Reactor ......... SUCCESS [  7.634 s]
[INFO] Apache Sling Testing - sample bundle with integration tests SUCCESS [ 56.757 s]
[INFO] Apache Sling Testing - sample module with integration tests SUCCESS [01:10 min]
[INFO] Apache Sling Testing PaxExam ....................... FAILURE [  9.931 s]
[INFO] Apache Sling Testing Modules Reactor ............... SKIPPED
[INFO] Apache Sling Installer ............................. SKIPPED
[INFO] Apache Sling File Installer ........................ SKIPPED
[INFO] Apache Sling JCR Installer ......................... SKIPPED
[INFO] Apache Sling Installer Configuration Admin Support . SKIPPED
[INFO] Apache Sling Deployment Package Installer .......... SKIPPED
[INFO] Apache Sling Subsystems Installer .................. SKIPPED
[INFO] Apache Sling Installer Integration Tests ........... SKIPPED
[INFO] Apache Sling Launchpad API ......................... SKIPPED
[INFO] Apache Sling Launchpad Installer ................... SKIPPED

[INFO] Apache Sling Launchpad Content ..................... SKIPPED
[INFO] Apache Sling Launchpad Testing Services ............ SKIPPED
[INFO] Apache Sling Launchpad Testing Services WAR ........ SKIPPED
[INFO] Apache Sling Launchpad Testing Fragment Bundle ..... SKIPPED
[INFO] Apache Sling Launchpad Test Bundles ................ SKIPPED
[INFO] Apache Sling Integration Tests ..................... SKIPPED
[INFO] Apache Sling Launchpad Testing ..................... SKIPPED
[INFO] Apache Sling (Builder) ............................. SKIPPED
[INFO] ------------------------------------------------------------------------
[INFO] BUILD FAILURE
[INFO] ------------------------------------------------------------------------
[INFO] Total time: 01:20 h
[INFO] Finished at: 2016-07-25T08:02:06+00:00
[INFO] Final Memory: 384M/455M
[INFO] ------------------------------------------------------------------------
Waiting for Jenkins to finish collecting data
[ERROR] Failed to execute goal org.apache.maven.plugins:maven-source-plugin:3.0.0:jar (attach-sources)
on project org.apache.sling.testing.paxexam: Error creating source archive: Problem creating
jar: Execution exception: Java heap space -> [Help 1]
[ERROR] 
[ERROR] To see the full stack trace of the errors, re-run Maven with the -e switch.
[ERROR] Re-run Maven using the -X switch to enable full debug logging.
[ERROR] 
[ERROR] For more information about the errors and possible solutions, please read the following
articles:
[ERROR] [Help 1] http://cwiki.apache.org/confluence/display/MAVEN/MojoExecutionException
[ERROR] 
[ERROR] After correcting the problems, you can resume the build with the command
[ERROR]   mvn <goals> -rf :org.apache.sling.testing.paxexam
channel stopped

Mime
View raw message