sling-commits mailing list archives

Site index · List index
Message view « Date » · « Thread »
Top « Date » · « Thread »
From Apache Jenkins Server <jenk...@builds.apache.org>
Subject Build failed in Jenkins: sling-trunk-1.7 #4239
Date Wed, 06 Jul 2016 13:59:42 GMT
See <https://builds.apache.org/job/sling-trunk-1.7/4239/>

------------------------------------------
[...truncated 123077 lines...]
[INFO] Apache Sling Subsystems Base Installer ............ SUCCESS [4.364s]
[INFO] Apache Sling Filesystem Resource Provider ......... SUCCESS [5.067s]
[INFO] Apache Sling Installer WebConsole Plugin .......... SUCCESS [4.615s]
[INFO] Apache Sling Launchpad Application Builder ........ SUCCESS [30.534s]
[INFO] Apache Sling Scripting Sightly Integration Tests .. SUCCESS [2:11.406s]
[INFO] Apache Sling Scripting Sightly Reactor ............ SUCCESS [2.680s]
[INFO] Apache Sling Adapter Manager Implementation ....... SUCCESS [6.415s]
[INFO] Apache Sling Bundle Resource Provider ............. SUCCESS [4.168s]
[INFO] Apache Sling Distributed Event Admin .............. SUCCESS [6.688s]
[INFO] Apache Sling Discovery API ........................ SUCCESS [6.242s]
[INFO] Apache Sling Discovery Commons .................... SUCCESS [1:18.136s]
[INFO] Apache Sling Discovery Base ....................... SUCCESS [1:12.578s]
[INFO] Apache Sling Resource-Based Discovery Service ..... SUCCESS [3:33.940s]
[INFO] Apache Sling Oak-Based Discovery Service .......... SUCCESS [2:41.309s]
[INFO] Apache Sling Discovery Support Bundle ............. SUCCESS [3.535s]
[INFO] Apache Sling Discovery Standalone Implementation .. SUCCESS [9.199s]
[INFO] Apache Sling Event Support ........................ SUCCESS [23:10.513s]
[INFO] Apache Sling Feature Flags ........................ SUCCESS [3.779s]
[INFO] Apache Sling javax.activation bundle .............. SUCCESS [4.498s]
[INFO] Apache Sling Service User Mapper .................. SUCCESS [16.836s]
[INFO] Apache Sling Settings ............................. SUCCESS [9.467s]
[INFO] Apache Sling Web Console Branding ................. SUCCESS [4.977s]
[INFO] Apache Sling Web Console Security Provider ........ SUCCESS [5.312s]
[INFO] Apache Sling Explorer ............................. SUCCESS [12.009s]
[INFO] Apache Sling Health Check Core .................... SUCCESS [2:00.326s]
[INFO] Apache Sling Health Check Samples ................. SUCCESS [4.370s]
[INFO] Apache Sling Health Check Support Components ...... SUCCESS [5.904s]
[INFO] Apache Sling Health Check Webconsole Plugin ....... SUCCESS [9.843s]
[INFO] Apache Sling Health Check JUnit Bridge ............ SUCCESS [6.886s]
[INFO] Apache Sling Health Check Annotations ............. SUCCESS [9.107s]
[INFO] Apache Sling Health Check Integration Tests ....... SUCCESS [9.381s]
[INFO] Apache Sling Health Check Reactor POM ............. SUCCESS [1.881s]
[INFO] Apache Sling Resource Access Security ............. SUCCESS [3.631s]
[INFO] Apache Sling Resource Access Security Integration Tests  SUCCESS [43.932s]
[INFO] Apache Sling Models API ........................... SUCCESS [5.409s]
[INFO] Apache Sling Models Implementation ................ SUCCESS [14.371s]
[INFO] Apache Sling Models Integration Tests ............. SUCCESS [53.039s]
[INFO] Apache Sling Internationalization Support ......... SUCCESS [1:31.592s]
[INFO] Apache Sling XSS Protection Bundle ................ SUCCESS [18.604s]
[INFO] Apache Sling JUnit Core ........................... SUCCESS [6.943s]
[INFO] Apache Sling JUnit Tests Teleporter ............... SUCCESS [10.636s]
[INFO] Apache Sling Resource Builder ..................... SUCCESS [46.936s]
[INFO] Apache Sling Servlet Helpers ...................... SUCCESS [5.034s]
[INFO] Apache Sling RepoInit Parser ...................... SUCCESS [4.756s]
[INFO] Apache Sling RepoInit JCR module .................. FAILURE [0.436s]
[INFO] Apache Sling RepoInit Integration Tests ........... SKIPPED
[INFO] Apache Sling RepoInit Reactor ..................... SKIPPED
[INFO] Apache Sling Test Tools ........................... SKIPPED
[INFO] Apache Sling Testing Clients ...................... SKIPPED
[INFO] Apache Sling Testing Hamcrest ..................... SKIPPED
[INFO] Apache Sling Server Setup Tools ................... SKIPPED
[INFO] Apache Sling Testing Rules ........................ SKIPPED
[INFO] Apache Sling JUnit Scriptable Tests Provider ...... SKIPPED
[INFO] Apache Sling JUnit Health Checks .................. SKIPPED
[INFO] Apache Sling JUnit Remote Tests Runners ........... SKIPPED
[INFO] Apache Sling JUnit Performance .................... SKIPPED
[INFO] Apache Sling Testing Mock Log Configuration ....... SKIPPED
[INFO] Apache Sling Testing Resource Resolver Mock ....... SKIPPED
[INFO] Apache Sling Testing JCR Mock ..................... SKIPPED
[INFO] Apache Sling Testing OSGi Mock .................... SKIPPED
[INFO] Apache Sling Testing Sling Mock ................... SKIPPED
[INFO] Apache Sling Testing Sling Mock Oak-based Resource Resolver  SKIPPED
[INFO] Apache Sling Testing Mocks Modules Reactor ........ SKIPPED
[INFO] Apache Sling Testing - sample bundle with integration tests  SKIPPED
[INFO] Apache Sling Testing - sample module with integration tests  SKIPPED
[INFO] Apache Sling Testing PaxExam ...................... SKIPPED
[INFO] Apache Sling Testing Modules Reactor .............. SKIPPED
[INFO] Apache Sling Installer ............................ SKIPPED
[INFO] Apache Sling File Installer ....................... SKIPPED
[INFO] Apache Sling JCR Installer ........................ SKIPPED
[INFO] Apache Sling Installer Configuration Admin Support  SKIPPED
[INFO] Apache Sling Deployment Package Installer ......... SKIPPED
[INFO] Apache Sling Subsystems Installer ................. SKIPPED
[INFO] Apache Sling Installer Integration Tests .......... SKIPPED
[INFO] Apache Sling Launchpad API ........................ SKIPPED
[INFO] Apache Sling Launchpad Installer .................. SKIPPED
[INFO] Apache Sling Launchpad Content .................... SKIPPED
[INFO] Apache Sling Launchpad Testing Services ........... SKIPPED
[INFO] Apache Sling Launchpad Testing Services WAR ....... SKIPPED
[INFO] Apache Sling Launchpad Testing Fragment Bundle .... SKIPPED
[INFO] Apache Sling Launchpad Test Bundles ............... SKIPPED
[INFO] Apache Sling Integration Tests .................... SKIPPED
[INFO] Apache Sling Launchpad Testing .................... SKIPPED
[INFO] Apache Sling (Builder) ............................ SKIPPED
[INFO] ------------------------------------------------------------------------
[INFO] BUILD FAILURE
[INFO] ------------------------------------------------------------------------
[INFO] Total time: 1:04:34.219s
[INFO] Finished at: Wed Jul 06 13:56:36 UTC 2016
[INFO] Final Memory: 194M/460M
[INFO] ------------------------------------------------------------------------
[JENKINS] Archiving disabled
[JENKINS] Archiving disabled
[JENKINS] Archiving disabled
[JENKINS] Archiving disabled
[JENKINS] Archiving disabled
[JENKINS] Archiving disabled
[JENKINS] Archiving disabled
[JENKINS] Archiving disabled
[JENKINS] Archiving disabled
[JENKINS] Archiving disabled
[JENKINS] Archiving disabled
[JENKINS] Archiving disabled
[JENKINS] Archiving disabled
[JENKINS] Archiving disabled
[JENKINS] Archiving disabled
[JENKINS] Archiving disabled
[JENKINS] Archiving disabled
[JENKINS] Archiving disabled
[JENKINS] Archiving disabled
[JENKINS] Archiving disabled
[JENKINS] Archiving disabled
[JENKINS] Archiving disabled
[JENKINS] Archiving disabled
[JENKINS] Archiving disabled
[JENKINS] Archiving disabled
[JENKINS] Archiving disabled
[JENKINS] Archiving disabled
[JENKINS] Archiving disabled
[JENKINS] Archiving disabled
[JENKINS] Archiving disabled
[JENKINS] Archiving disabled
[JENKINS] Archiving disabled
[JENKINS] Archiving disabled
[JENKINS] Archiving disabled
[JENKINS] Archiving disabled
[JENKINS] Archiving disabled
[JENKINS] Archiving disabled
[JENKINS] Archiving disabled
[JENKINS] Archiving disabled
[JENKINS] Archiving disabled
[JENKINS] Archiving disabled
[JENKINS] Archiving disabled
[JENKINS] Archiving disabled
[JENKINS] Archiving disabled
[JENKINS] Archiving disabled
[JENKINS] Archiving disabled
[JENKINS] Archiving disabled
[JENKINS] Archiving disabled
[JENKINS] Archiving disabled
[JENKINS] Archiving disabled
[JENKINS] Archiving disabled
[JENKINS] Archiving disabled
[JENKINS] Archiving disabled
[JENKINS] Archiving disabled
[JENKINS] Archiving disabled
[JENKINS] Archiving disabled
[JENKINS] Archiving disabled
[JENKINS] Archiving disabled
[JENKINS] Archiving disabled
[JENKINS] Archiving disabled
[JENKINS] Archiving disabled
[JENKINS] Archiving disabled
[JENKINS] Archiving disabled
[JENKINS] Archiving disabled
[JENKINS] Archiving disabled
[JENKINS] Archiving disabled
[JENKINS] Archiving disabled
[JENKINS] Archiving disabled
[JENKINS] Archiving disabled
[JENKINS] Archiving disabled
[JENKINS] Archiving disabled
[JENKINS] Archiving disabled
[JENKINS] Archiving disabled
[JENKINS] Archiving disabled
[JENKINS] Archiving disabled
[JENKINS] Archiving disabled
[JENKINS] Archiving disabled
[JENKINS] Archiving disabled
[JENKINS] Archiving disabled
[JENKINS] Archiving disabled
[JENKINS] Archiving disabled
[JENKINS] Archiving disabled
[JENKINS] Archiving disabled
[JENKINS] Archiving disabled
[JENKINS] Archiving disabled
[JENKINS] Archiving disabled
[JENKINS] Archiving disabled
[JENKINS] Archiving disabled
[JENKINS] Archiving disabled
[JENKINS] Archiving disabled
[JENKINS] Archiving disabled
[JENKINS] Archiving disabled
[JENKINS] Archiving disabled
[JENKINS] Archiving disabled
[JENKINS] Archiving disabled
[JENKINS] Archiving disabled
[JENKINS] Archiving disabled
[JENKINS] Archiving disabled
[JENKINS] Archiving disabled
[JENKINS] Archiving disabled
[JENKINS] Archiving disabled
[JENKINS] Archiving disabled
[JENKINS] Archiving disabled
[JENKINS] Archiving disabled
[JENKINS] Archiving disabled
[JENKINS] Archiving disabled
[JENKINS] Archiving disabled
[JENKINS] Archiving disabled
[JENKINS] Archiving disabled
[JENKINS] Archiving disabled
[JENKINS] Archiving disabled
[JENKINS] Archiving disabled
[JENKINS] Archiving disabled
[JENKINS] Archiving disabled
[JENKINS] Archiving disabled
[JENKINS] Archiving disabled
[JENKINS] Archiving disabled
[JENKINS] Archiving disabled
[JENKINS] Archiving disabled
[JENKINS] Archiving disabled
[JENKINS] Archiving disabled
[JENKINS] Archiving disabled
[JENKINS] Archiving disabled
[JENKINS] Archiving disabled
[JENKINS] Archiving disabled
[JENKINS] Archiving disabled
[JENKINS] Archiving disabled
[JENKINS] Archiving disabled
[JENKINS] Archiving disabled
[JENKINS] Archiving disabled
[JENKINS] Archiving disabled
[JENKINS] Archiving disabled
[JENKINS] Archiving disabled
[JENKINS] Archiving disabled
[JENKINS] Archiving disabled
[JENKINS] Archiving disabled
[JENKINS] Archiving disabled
[JENKINS] Archiving disabled
[JENKINS] Archiving disabled
[JENKINS] Archiving disabled
[JENKINS] Archiving disabled
[JENKINS] Archiving disabled
[JENKINS] Archiving disabled
[JENKINS] Archiving disabled
[JENKINS] Archiving disabled
[JENKINS] Archiving disabled
Waiting for Jenkins to finish collecting data
[ERROR] Failed to execute goal on project org.apache.sling.jcr.repoinit: Could not resolve
dependencies for project org.apache.sling:org.apache.sling.jcr.repoinit:bundle:1.0.1-SNAPSHOT:
Could not find artifact org.apache.sling:org.apache.sling.repoinit.parser:jar:1.0.2 in central
(http://repo.maven.apache.org/maven2) -> [Help 1]
[ERROR] 
[ERROR] To see the full stack trace of the errors, re-run Maven with the -e switch.
[ERROR] Re-run Maven using the -X switch to enable full debug logging.
[ERROR] 
[ERROR] For more information about the errors and possible solutions, please read the following
articles:
[ERROR] [Help 1] http://cwiki.apache.org/confluence/display/MAVEN/DependencyResolutionException
[ERROR] 
[ERROR] After correcting the problems, you can resume the build with the command
[ERROR]   mvn <goals> -rf :org.apache.sling.jcr.repoinit
channel stopped

Mime
View raw message