sling-commits mailing list archives

Site index · List index
Message view « Date » · « Thread »
Top « Date » · « Thread »
From Apache Jenkins Server <jenk...@builds.apache.org>
Subject Build failed in Jenkins: sling-trunk-1.7 #4238
Date Wed, 06 Jul 2016 09:48:09 GMT
See <https://builds.apache.org/job/sling-trunk-1.7/4238/changes>

Changes:

[olli] SLING-5680 Add Integration Tests for Scripting Thymeleaf

merge module org.apache.sling.scripting.thymeleaf.it into org.apache.sling.scripting.thymeleaf

[olli] move module scripting/org.apache.sling.scripting.thymeleaf to new profile java8

------------------------------------------
Started by an SCM change
[EnvInject] - Loading node environment variables.
Building remotely on jenkins-test-af1 (jenkins-cloud-4GB cloud-slave Ubuntu ubuntu jenkins-cloud-8GB)
in workspace <https://builds.apache.org/job/sling-trunk-1.7/ws/>
Cleaning up <https://builds.apache.org/job/sling-trunk-1.7/ws/trunk>
Updating http://svn.apache.org/repos/asf/sling/trunk at revision '2016-07-06T09:47:42.273
+0000'
D         contrib/scripting/org.apache.sling.scripting.thymeleaf.it
A         contrib/scripting/org.apache.sling.scripting.thymeleaf/src/test
A         contrib/scripting/org.apache.sling.scripting.thymeleaf/src/test/java
A         contrib/scripting/org.apache.sling.scripting.thymeleaf/src/test/java/org
A         contrib/scripting/org.apache.sling.scripting.thymeleaf/src/test/java/org/apache
A         contrib/scripting/org.apache.sling.scripting.thymeleaf/src/test/java/org/apache/sling
A         contrib/scripting/org.apache.sling.scripting.thymeleaf/src/test/java/org/apache/sling/scripting
A         contrib/scripting/org.apache.sling.scripting.thymeleaf/src/test/java/org/apache/sling/scripting/thymeleaf
A         contrib/scripting/org.apache.sling.scripting.thymeleaf/src/test/java/org/apache/sling/scripting/thymeleaf/it
A         contrib/scripting/org.apache.sling.scripting.thymeleaf/src/test/java/org/apache/sling/scripting/thymeleaf/it/app
A         contrib/scripting/org.apache.sling.scripting.thymeleaf/src/test/java/org/apache/sling/scripting/thymeleaf/it/app/Activator.java
A         contrib/scripting/org.apache.sling.scripting.thymeleaf/src/test/java/org/apache/sling/scripting/thymeleaf/it/app/Page.java
A         contrib/scripting/org.apache.sling.scripting.thymeleaf/src/test/java/org/apache/sling/scripting/thymeleaf/it/app/FooBarLinkBuilder.java
A         contrib/scripting/org.apache.sling.scripting.thymeleaf/src/test/java/org/apache/sling/scripting/thymeleaf/it/tests
A         contrib/scripting/org.apache.sling.scripting.thymeleaf/src/test/java/org/apache/sling/scripting/thymeleaf/it/tests/AdaptToModelIT.java
A         contrib/scripting/org.apache.sling.scripting.thymeleaf/src/test/java/org/apache/sling/scripting/thymeleaf/it/tests/ThymeleafDecoupledTemplateLogicIT.java
A         contrib/scripting/org.apache.sling.scripting.thymeleaf/src/test/java/org/apache/sling/scripting/thymeleaf/it/tests/ThymeleafTestSupport.java
A         contrib/scripting/org.apache.sling.scripting.thymeleaf/src/test/java/org/apache/sling/scripting/thymeleaf/it/tests/SlingIncludeIT.java
A         contrib/scripting/org.apache.sling.scripting.thymeleaf/src/test/java/org/apache/sling/scripting/thymeleaf/it/tests/TemplateEngineIT.java
A         contrib/scripting/org.apache.sling.scripting.thymeleaf/src/test/java/org/apache/sling/scripting/thymeleaf/it/tests/ThymeleafScriptEngineFactoryIT.java
A         contrib/scripting/org.apache.sling.scripting.thymeleaf/src/test/java/org/apache/sling/scripting/thymeleaf/it/tests/ThymeleafTextIT.java
A         contrib/scripting/org.apache.sling.scripting.thymeleaf/src/test/java/org/apache/sling/scripting/thymeleaf/it/tests/LinkBuilderIT.java
A         contrib/scripting/org.apache.sling.scripting.thymeleaf/src/test/java/org/apache/sling/scripting/thymeleaf/it/tests/ThymeleafReplaceIT.java
A         contrib/scripting/org.apache.sling.scripting.thymeleaf/src/test/resources
A         contrib/scripting/org.apache.sling.scripting.thymeleaf/src/test/resources/apps
A         contrib/scripting/org.apache.sling.scripting.thymeleaf/src/test/resources/apps/jsp
A         contrib/scripting/org.apache.sling.scripting.thymeleaf/src/test/resources/apps/jsp/page
A         contrib/scripting/org.apache.sling.scripting.thymeleaf/src/test/resources/apps/jsp/page/resource
A         contrib/scripting/org.apache.sling.scripting.thymeleaf/src/test/resources/apps/jsp/page/resource/html.jsp
A         contrib/scripting/org.apache.sling.scripting.thymeleaf/src/test/resources/apps/thymeleaf
A         contrib/scripting/org.apache.sling.scripting.thymeleaf/src/test/resources/apps/thymeleaf/ROOT.json
A         contrib/scripting/org.apache.sling.scripting.thymeleaf/src/test/resources/apps/thymeleaf/page
A         contrib/scripting/org.apache.sling.scripting.thymeleaf/src/test/resources/apps/thymeleaf/page/replace
A         contrib/scripting/org.apache.sling.scripting.thymeleaf/src/test/resources/apps/thymeleaf/page/replace/html.html
A         contrib/scripting/org.apache.sling.scripting.thymeleaf/src/test/resources/apps/thymeleaf/page/adaptto
A         contrib/scripting/org.apache.sling.scripting.thymeleaf/src/test/resources/apps/thymeleaf/page/adaptto/html.html
A         contrib/scripting/org.apache.sling.scripting.thymeleaf/src/test/resources/apps/thymeleaf/page/link
A         contrib/scripting/org.apache.sling.scripting.thymeleaf/src/test/resources/apps/thymeleaf/page/link/html.html
A         contrib/scripting/org.apache.sling.scripting.thymeleaf/src/test/resources/apps/thymeleaf/page/include
A         contrib/scripting/org.apache.sling.scripting.thymeleaf/src/test/resources/apps/thymeleaf/page/include/html.html
A         contrib/scripting/org.apache.sling.scripting.thymeleaf/src/test/resources/apps/thymeleaf/page/decoupled
A         contrib/scripting/org.apache.sling.scripting.thymeleaf/src/test/resources/apps/thymeleaf/page/decoupled/html.html
A         contrib/scripting/org.apache.sling.scripting.thymeleaf/src/test/resources/apps/thymeleaf/page/decoupled/html.th.xml
A         contrib/scripting/org.apache.sling.scripting.thymeleaf/src/test/resources/apps/thymeleaf/page/main
A         contrib/scripting/org.apache.sling.scripting.thymeleaf/src/test/resources/apps/thymeleaf/page/main/html.html
A         contrib/scripting/org.apache.sling.scripting.thymeleaf/src/test/resources/apps/thymeleaf/page/text
A         contrib/scripting/org.apache.sling.scripting.thymeleaf/src/test/resources/apps/thymeleaf/page/text/html.html
A         contrib/scripting/org.apache.sling.scripting.thymeleaf/src/test/resources/apps/thymeleaf/page/fragments
A         contrib/scripting/org.apache.sling.scripting.thymeleaf/src/test/resources/apps/thymeleaf/page/fragments/head.html
A         contrib/scripting/org.apache.sling.scripting.thymeleaf/src/test/resources/content
A         contrib/scripting/org.apache.sling.scripting.thymeleaf/src/test/resources/content/thymeleaf.json
U         contrib/scripting/org.apache.sling.scripting.thymeleaf/pom.xml
U         contrib/pom.xml
At revision 1751647

Parsing POMs
ERROR: Failed to parse POMs
java.io.IOException: remote file operation failed: <https://builds.apache.org/job/sling-trunk-1.7/ws/trunk>
at hudson.remoting.Channel@3fcbbafe:jenkins-test-af1: hudson.remoting.ProxyException: hudson.maven.MavenModuleSetBuild$MavenExecutionException:
org.apache.maven.project.ProjectBuildingException: Some problems were encountered while processing
the POMs:
[FATAL] Non-resolvable parent POM: Could not find artifact org.apache.sling:sling:pom:27-SNAPSHOT
and 'parent.relativePath' points at no local POM @ line 24, column 11

	at hudson.FilePath.act(FilePath.java:986)
	at hudson.FilePath.act(FilePath.java:968)
	at hudson.maven.MavenModuleSetBuild$MavenModuleSetBuildExecution.parsePoms(MavenModuleSetBuild.java:960)
	at hudson.maven.MavenModuleSetBuild$MavenModuleSetBuildExecution.doRun(MavenModuleSetBuild.java:679)
	at hudson.model.AbstractBuild$AbstractBuildExecution.run(AbstractBuild.java:534)
	at hudson.model.Run.execute(Run.java:1738)
	at hudson.maven.MavenModuleSetBuild.run(MavenModuleSetBuild.java:531)
	at hudson.model.ResourceController.execute(ResourceController.java:98)
	at hudson.model.Executor.run(Executor.java:410)
Caused by: hudson.remoting.ProxyException: hudson.maven.MavenModuleSetBuild$MavenExecutionException:
org.apache.maven.project.ProjectBuildingException: Some problems were encountered while processing
the POMs:
[FATAL] Non-resolvable parent POM: Could not find artifact org.apache.sling:sling:pom:27-SNAPSHOT
and 'parent.relativePath' points at no local POM @ line 24, column 11

	at hudson.maven.MavenModuleSetBuild$PomParser.invoke(MavenModuleSetBuild.java:1364)
	at hudson.maven.MavenModuleSetBuild$PomParser.invoke(MavenModuleSetBuild.java:1098)
	at hudson.FilePath$FileCallableWrapper.call(FilePath.java:2719)
	at hudson.remoting.UserRequest.perform(UserRequest.java:120)
	at hudson.remoting.UserRequest.perform(UserRequest.java:48)
	at hudson.remoting.Request$2.run(Request.java:326)
	at hudson.remoting.InterceptingExecutorService$1.call(InterceptingExecutorService.java:68)
	at java.util.concurrent.FutureTask.run(FutureTask.java:262)
	at java.util.concurrent.ThreadPoolExecutor.runWorker(ThreadPoolExecutor.java:1145)
	at java.util.concurrent.ThreadPoolExecutor$Worker.run(ThreadPoolExecutor.java:615)
	at java.lang.Thread.run(Thread.java:745)
	at ......remote call to jenkins-test-af1(Native Method)
	at hudson.remoting.Channel.attachCallSiteStackTrace(Channel.java:1416)
	at hudson.remoting.UserResponse.retrieve(UserRequest.java:220)
	at hudson.remoting.Channel.call(Channel.java:781)
	at hudson.FilePath.act(FilePath.java:979)
	... 8 more
Caused by: hudson.remoting.ProxyException: org.apache.maven.project.ProjectBuildingException:
Some problems were encountered while processing the POMs:
[FATAL] Non-resolvable parent POM: Could not find artifact org.apache.sling:sling:pom:27-SNAPSHOT
and 'parent.relativePath' points at no local POM @ line 24, column 11

	at org.apache.maven.project.DefaultProjectBuilder.build(DefaultProjectBuilder.java:364)
	at hudson.maven.MavenEmbedder.buildProjects(MavenEmbedder.java:361)
	at hudson.maven.MavenEmbedder.readProjects(MavenEmbedder.java:331)
	at hudson.maven.MavenModuleSetBuild$PomParser.invoke(MavenModuleSetBuild.java:1301)
	at hudson.maven.MavenModuleSetBuild$PomParser.invoke(MavenModuleSetBuild.java:1098)
	at hudson.FilePath$FileCallableWrapper.call(FilePath.java:2719)
	at hudson.remoting.UserRequest.perform(UserRequest.java:120)
	at hudson.remoting.UserRequest.perform(UserRequest.java:48)
	at hudson.remoting.Request$2.run(Request.java:326)
	at hudson.remoting.InterceptingExecutorService$1.call(InterceptingExecutorService.java:68)
	at java.util.concurrent.FutureTask.run(FutureTask.java:262)
	at java.util.concurrent.ThreadPoolExecutor.runWorker(ThreadPoolExecutor.java:1145)
	at java.util.concurrent.ThreadPoolExecutor$Worker.run(ThreadPoolExecutor.java:615)
	at java.lang.Thread.run(Thread.java:745)

Mime
View raw message