sling-commits mailing list archives

Site index · List index
Message view « Date » · « Thread »
Top « Date » · « Thread »
From Apache Jenkins Server <jenk...@builds.apache.org>
Subject Build failed in Jenkins: sling-trunk-1.7 #4240
Date Wed, 06 Jul 2016 15:18:59 GMT
See <https://builds.apache.org/job/sling-trunk-1.7/4240/changes>

Changes:

[bdelacretaz] SLING-5682 - add tests for createPrincipal* methods, contributed by Nicolas
Peltier, thanks!

------------------------------------------
[...truncated 113021 lines...]
[INFO] Apache Sling Subsystems Base Installer ............ SUCCESS [3.861s]
[INFO] Apache Sling Filesystem Resource Provider ......... SUCCESS [7.916s]
[INFO] Apache Sling Installer WebConsole Plugin .......... SUCCESS [3.778s]
[INFO] Apache Sling Launchpad Application Builder ........ SUCCESS [32.729s]
[INFO] Apache Sling Scripting Sightly Integration Tests .. SUCCESS [4:32.610s]
[INFO] Apache Sling Scripting Sightly Reactor ............ SUCCESS [1.531s]
[INFO] Apache Sling Adapter Manager Implementation ....... SUCCESS [39.598s]
[INFO] Apache Sling Bundle Resource Provider ............. SUCCESS [32.740s]
[INFO] Apache Sling Distributed Event Admin .............. SUCCESS [18.991s]
[INFO] Apache Sling Discovery API ........................ SUCCESS [43.930s]
[INFO] Apache Sling Discovery Commons .................... SUCCESS [1:32.041s]
[INFO] Apache Sling Discovery Base ....................... SUCCESS [1:33.115s]
[INFO] Apache Sling Resource-Based Discovery Service ..... SUCCESS [4:09.916s]
[INFO] Apache Sling Oak-Based Discovery Service .......... SUCCESS [2:42.337s]
[INFO] Apache Sling Discovery Support Bundle ............. SUCCESS [24.832s]
[INFO] Apache Sling Discovery Standalone Implementation .. SUCCESS [6.432s]
[INFO] Apache Sling Event Support ........................ SUCCESS [26:55.242s]
[INFO] Apache Sling Feature Flags ........................ SUCCESS [4.235s]
[INFO] Apache Sling javax.activation bundle .............. SUCCESS [5.494s]
[INFO] Apache Sling Service User Mapper .................. SUCCESS [6.502s]
[INFO] Apache Sling Settings ............................. SUCCESS [4.103s]
[INFO] Apache Sling Web Console Branding ................. SUCCESS [5.652s]
[INFO] Apache Sling Web Console Security Provider ........ SUCCESS [3.695s]
[INFO] Apache Sling Explorer ............................. SUCCESS [5.402s]
[INFO] Apache Sling Health Check Core .................... SUCCESS [1:54.965s]
[INFO] Apache Sling Health Check Samples ................. SUCCESS [6.628s]
[INFO] Apache Sling Health Check Support Components ...... SUCCESS [4.685s]
[INFO] Apache Sling Health Check Webconsole Plugin ....... SUCCESS [4.014s]
[INFO] Apache Sling Health Check JUnit Bridge ............ SUCCESS [13.224s]
[INFO] Apache Sling Health Check Annotations ............. SUCCESS [23.818s]
[INFO] Apache Sling Health Check Integration Tests ....... SUCCESS [8.350s]
[INFO] Apache Sling Health Check Reactor POM ............. SUCCESS [2.715s]
[INFO] Apache Sling Resource Access Security ............. SUCCESS [3.995s]
[INFO] Apache Sling Resource Access Security Integration Tests  SUCCESS [58.726s]
[INFO] Apache Sling Models API ........................... SUCCESS [8.462s]
[INFO] Apache Sling Models Implementation ................ SUCCESS [7.675s]
[INFO] Apache Sling Models Integration Tests ............. SUCCESS [1:02.141s]
[INFO] Apache Sling Internationalization Support ......... SUCCESS [1:40.305s]
[INFO] Apache Sling XSS Protection Bundle ................ SUCCESS [14.616s]
[INFO] Apache Sling JUnit Core ........................... SUCCESS [5.746s]
[INFO] Apache Sling JUnit Tests Teleporter ............... SUCCESS [8.337s]
[INFO] Apache Sling Resource Builder ..................... SUCCESS [28.437s]
[INFO] Apache Sling Servlet Helpers ...................... SUCCESS [10.768s]
[INFO] Apache Sling RepoInit Parser ...................... SUCCESS [5.572s]
[INFO] Apache Sling RepoInit JCR module .................. FAILURE [0.215s]
[INFO] Apache Sling RepoInit Integration Tests ........... SKIPPED
[INFO] Apache Sling RepoInit Reactor ..................... SKIPPED
[INFO] Apache Sling Test Tools ........................... SKIPPED
[INFO] Apache Sling Testing Clients ...................... SKIPPED
[INFO] Apache Sling Testing Hamcrest ..................... SKIPPED
[INFO] Apache Sling Server Setup Tools ................... SKIPPED
[INFO] Apache Sling Testing Rules ........................ SKIPPED
[INFO] Apache Sling JUnit Scriptable Tests Provider ...... SKIPPED
[INFO] Apache Sling JUnit Health Checks .................. SKIPPED
[INFO] Apache Sling JUnit Remote Tests Runners ........... SKIPPED
[INFO] Apache Sling JUnit Performance .................... SKIPPED
[INFO] Apache Sling Testing Mock Log Configuration ....... SKIPPED
[INFO] Apache Sling Testing Resource Resolver Mock ....... SKIPPED
[INFO] Apache Sling Testing JCR Mock ..................... SKIPPED
[INFO] Apache Sling Testing OSGi Mock .................... SKIPPED
[INFO] Apache Sling Testing Sling Mock ................... SKIPPED
[INFO] Apache Sling Testing Sling Mock Oak-based Resource Resolver  SKIPPED
[INFO] Apache Sling Testing Mocks Modules Reactor ........ SKIPPED
[INFO] Apache Sling Testing - sample bundle with integration tests  SKIPPED
[INFO] Apache Sling Testing - sample module with integration tests  SKIPPED
[INFO] Apache Sling Testing PaxExam ...................... SKIPPED
[INFO] Apache Sling Testing Modules Reactor .............. SKIPPED
[INFO] Apache Sling Installer ............................ SKIPPED
[INFO] Apache Sling File Installer ....................... SKIPPED
[INFO] Apache Sling JCR Installer ........................ SKIPPED
[INFO] Apache Sling Installer Configuration Admin Support  SKIPPED
[INFO] Apache Sling Deployment Package Installer ......... SKIPPED
[INFO] Apache Sling Subsystems Installer ................. SKIPPED
[INFO] Apache Sling Installer Integration Tests .......... SKIPPED
[INFO] Apache Sling Launchpad API ........................ SKIPPED
[INFO] Apache Sling Launchpad Installer .................. SKIPPED
[INFO] Apache Sling Launchpad Content .................... SKIPPED
[INFO] Apache Sling Launchpad Testing Services ........... SKIPPED
[INFO] Apache Sling Launchpad Testing Services WAR ....... SKIPPED
[INFO] Apache Sling Launchpad Testing Fragment Bundle .... SKIPPED
[INFO] Apache Sling Launchpad Test Bundles ............... SKIPPED
[INFO] Apache Sling Integration Tests .................... SKIPPED
[INFO] Apache Sling Launchpad Testing .................... SKIPPED
[INFO] Apache Sling (Builder) ............................ SKIPPED
[INFO] ------------------------------------------------------------------------
[INFO] BUILD FAILURE
[INFO] ------------------------------------------------------------------------
[INFO] Total time: 1:13:54.154s
[INFO] Finished at: Wed Jul 06 15:15:43 UTC 2016
[INFO] Final Memory: 198M/459M
[INFO] ------------------------------------------------------------------------
[JENKINS] Archiving disabled
[JENKINS] Archiving disabled
[JENKINS] Archiving disabled
[JENKINS] Archiving disabled
[JENKINS] Archiving disabled
[JENKINS] Archiving disabled
[JENKINS] Archiving disabled
[JENKINS] Archiving disabled
[JENKINS] Archiving disabled
[JENKINS] Archiving disabled
[JENKINS] Archiving disabled
[JENKINS] Archiving disabled
[JENKINS] Archiving disabled
[JENKINS] Archiving disabled
[JENKINS] Archiving disabled
[JENKINS] Archiving disabled
[JENKINS] Archiving disabled
[JENKINS] Archiving disabled
[JENKINS] Archiving disabled
[JENKINS] Archiving disabled
[JENKINS] Archiving disabled
[JENKINS] Archiving disabled
[JENKINS] Archiving disabled
[JENKINS] Archiving disabled
[JENKINS] Archiving disabled
[JENKINS] Archiving disabled
[JENKINS] Archiving disabled
[JENKINS] Archiving disabled
[JENKINS] Archiving disabled
[JENKINS] Archiving disabled
[JENKINS] Archiving disabled
[JENKINS] Archiving disabled
[JENKINS] Archiving disabled
[JENKINS] Archiving disabled
[JENKINS] Archiving disabled
[JENKINS] Archiving disabled
[JENKINS] Archiving disabled
[JENKINS] Archiving disabled
[JENKINS] Archiving disabled
[JENKINS] Archiving disabled
[JENKINS] Archiving disabled
[JENKINS] Archiving disabled
[JENKINS] Archiving disabled
[JENKINS] Archiving disabled
[JENKINS] Archiving disabled
[JENKINS] Archiving disabled
[JENKINS] Archiving disabled
[JENKINS] Archiving disabled
[JENKINS] Archiving disabled
[JENKINS] Archiving disabled
[JENKINS] Archiving disabled
[JENKINS] Archiving disabled
[JENKINS] Archiving disabled
[JENKINS] Archiving disabled
[JENKINS] Archiving disabled
[JENKINS] Archiving disabled
[JENKINS] Archiving disabled
[JENKINS] Archiving disabled
[JENKINS] Archiving disabled
[JENKINS] Archiving disabled
[JENKINS] Archiving disabled
[JENKINS] Archiving disabled
[JENKINS] Archiving disabled
[JENKINS] Archiving disabled
[JENKINS] Archiving disabled
[JENKINS] Archiving disabled
[JENKINS] Archiving disabled
[JENKINS] Archiving disabled
[JENKINS] Archiving disabled
[JENKINS] Archiving disabled
[JENKINS] Archiving disabled
[JENKINS] Archiving disabled
[JENKINS] Archiving disabled
[JENKINS] Archiving disabled
[JENKINS] Archiving disabled
[JENKINS] Archiving disabled
[JENKINS] Archiving disabled
[JENKINS] Archiving disabled
[JENKINS] Archiving disabled
[JENKINS] Archiving disabled
[JENKINS] Archiving disabled
[JENKINS] Archiving disabled
[JENKINS] Archiving disabled
[JENKINS] Archiving disabled
[JENKINS] Archiving disabled
[JENKINS] Archiving disabled
[JENKINS] Archiving disabled
[JENKINS] Archiving disabled
[JENKINS] Archiving disabled
[JENKINS] Archiving disabled
[JENKINS] Archiving disabled
[JENKINS] Archiving disabled
[JENKINS] Archiving disabled
[JENKINS] Archiving disabled
[JENKINS] Archiving disabled
[JENKINS] Archiving disabled
[JENKINS] Archiving disabled
[JENKINS] Archiving disabled
[JENKINS] Archiving disabled
[JENKINS] Archiving disabled
[JENKINS] Archiving disabled
[JENKINS] Archiving disabled
[JENKINS] Archiving disabled
[JENKINS] Archiving disabled
[JENKINS] Archiving disabled
[JENKINS] Archiving disabled
[JENKINS] Archiving disabled
[JENKINS] Archiving disabled
[JENKINS] Archiving disabled
[JENKINS] Archiving disabled
[JENKINS] Archiving disabled
[JENKINS] Archiving disabled
[JENKINS] Archiving disabled
[JENKINS] Archiving disabled
[JENKINS] Archiving disabled
[JENKINS] Archiving disabled
[JENKINS] Archiving disabled
[JENKINS] Archiving disabled
[JENKINS] Archiving disabled
[JENKINS] Archiving disabled
[JENKINS] Archiving disabled
[JENKINS] Archiving disabled
[JENKINS] Archiving disabled
[JENKINS] Archiving disabled
[JENKINS] Archiving disabled
[JENKINS] Archiving disabled
[JENKINS] Archiving disabled
[JENKINS] Archiving disabled
[JENKINS] Archiving disabled
[JENKINS] Archiving disabled
[JENKINS] Archiving disabled
[JENKINS] Archiving disabled
[JENKINS] Archiving disabled
[JENKINS] Archiving disabled
[JENKINS] Archiving disabled
[JENKINS] Archiving disabled
[JENKINS] Archiving disabled
[JENKINS] Archiving disabled
[JENKINS] Archiving disabled
[JENKINS] Archiving disabled
[JENKINS] Archiving disabled
[JENKINS] Archiving disabled
[JENKINS] Archiving disabled
[JENKINS] Archiving disabled
[JENKINS] Archiving disabled
[JENKINS] Archiving disabled
Waiting for Jenkins to finish collecting data
[ERROR] Failed to execute goal on project org.apache.sling.jcr.repoinit: Could not resolve
dependencies for project org.apache.sling:org.apache.sling.jcr.repoinit:bundle:1.0.1-SNAPSHOT:
Could not find artifact org.apache.sling:org.apache.sling.repoinit.parser:jar:1.0.2 in central
(http://repo.maven.apache.org/maven2) -> [Help 1]
[ERROR] 
[ERROR] To see the full stack trace of the errors, re-run Maven with the -e switch.
[ERROR] Re-run Maven using the -X switch to enable full debug logging.
[ERROR] 
[ERROR] For more information about the errors and possible solutions, please read the following
articles:
[ERROR] [Help 1] http://cwiki.apache.org/confluence/display/MAVEN/DependencyResolutionException
[ERROR] 
[ERROR] After correcting the problems, you can resume the build with the command
[ERROR]   mvn <goals> -rf :org.apache.sling.jcr.repoinit
channel stopped

Mime
View raw message