sling-commits mailing list archives

Site index · List index
Message view « Date » · « Thread »
Top « Date » · « Thread »
From Apache Jenkins Server <jenk...@builds.apache.org>
Subject Build failed in Jenkins: sling-trunk-1.8 #3493
Date Wed, 06 Jul 2016 19:58:19 GMT
See <https://builds.apache.org/job/sling-trunk-1.8/3493/>

------------------------------------------
[...truncated 131444 lines...]
[INFO] Apache Sling Scripting Sightly JavaScript Use Provider  SUCCESS [2.347s]
[INFO] Apache Sling Scripting Sightly Models Use Provider  SUCCESS [6.217s]
[INFO] Apache Sling Scripting Sightly Read-Eval-Print Loop Environment  SUCCESS [6.655s]
[INFO] Apache Sling Scripting Sightly Integration Tests Content  SUCCESS [6.961s]
[INFO] Apache Sling Launchpad Base ....................... SUCCESS [22.455s]
[INFO] Apache Sling Subsystems Base Installer ............ SUCCESS [4.855s]
[INFO] Apache Sling Filesystem Resource Provider ......... SUCCESS [2.872s]
[INFO] Apache Sling Installer WebConsole Plugin .......... SUCCESS [1.639s]
[INFO] Apache Sling Launchpad Application Builder ........ SUCCESS [25.289s]
[INFO] Apache Sling Scripting Sightly Integration Tests .. SUCCESS [2:03.592s]
[INFO] Apache Sling Scripting Sightly Reactor ............ SUCCESS [1.291s]
[INFO] Apache Sling Adapter Manager Implementation ....... SUCCESS [8.962s]
[INFO] Apache Sling Bundle Resource Provider ............. SUCCESS [5.114s]
[INFO] Apache Sling Distributed Event Admin .............. SUCCESS [2.502s]
[INFO] Apache Sling Discovery API ........................ SUCCESS [3.792s]
[INFO] Apache Sling Discovery Commons .................... SUCCESS [1:05.905s]
[INFO] Apache Sling Discovery Base ....................... SUCCESS [1:11.567s]
[INFO] Apache Sling Resource-Based Discovery Service ..... SUCCESS [3:48.550s]
[INFO] Apache Sling Oak-Based Discovery Service .......... SUCCESS [2:34.860s]
[INFO] Apache Sling Discovery Support Bundle ............. SUCCESS [2.805s]
[INFO] Apache Sling Discovery Standalone Implementation .. SUCCESS [2.465s]
[INFO] Apache Sling Event Support ........................ SUCCESS [25:18.144s]
[INFO] Apache Sling Feature Flags ........................ SUCCESS [5.355s]
[INFO] Apache Sling javax.activation bundle .............. SUCCESS [3.179s]
[INFO] Apache Sling Service User Mapper .................. SUCCESS [2.514s]
[INFO] Apache Sling Settings ............................. SUCCESS [4.093s]
[INFO] Apache Sling Web Console Branding ................. SUCCESS [1.432s]
[INFO] Apache Sling Web Console Security Provider ........ SUCCESS [3.120s]
[INFO] Apache Sling Explorer ............................. SUCCESS [6.269s]
[INFO] Apache Sling Health Check Core .................... SUCCESS [1:24.414s]
[INFO] Apache Sling Health Check Samples ................. SUCCESS [5.062s]
[INFO] Apache Sling Health Check Support Components ...... SUCCESS [9.206s]
[INFO] Apache Sling Health Check Webconsole Plugin ....... SUCCESS [1.533s]
[INFO] Apache Sling Health Check JUnit Bridge ............ SUCCESS [5.996s]
[INFO] Apache Sling Health Check Annotations ............. SUCCESS [1.679s]
[INFO] Apache Sling Health Check Integration Tests ....... SUCCESS [5.204s]
[INFO] Apache Sling Health Check Reactor POM ............. SUCCESS [0.881s]
[INFO] Apache Sling Resource Access Security ............. SUCCESS [3.081s]
[INFO] Apache Sling Resource Access Security Integration Tests  SUCCESS [48.678s]
[INFO] Apache Sling Models API ........................... SUCCESS [1.873s]
[INFO] Apache Sling Models Implementation ................ SUCCESS [7.739s]
[INFO] Apache Sling Models Integration Tests ............. SUCCESS [52.413s]
[INFO] Apache Sling Internationalization Support ......... SUCCESS [1:31.988s]
[INFO] Apache Sling XSS Protection Bundle ................ SUCCESS [14.949s]
[INFO] Apache Sling JUnit Core ........................... SUCCESS [3.375s]
[INFO] Apache Sling JUnit Tests Teleporter ............... SUCCESS [11.687s]
[INFO] Apache Sling Resource Builder ..................... SUCCESS [23.815s]
[INFO] Apache Sling Servlet Helpers ...................... SUCCESS [2.783s]
[INFO] Apache Sling RepoInit Parser ...................... SUCCESS [7.638s]
[INFO] Apache Sling RepoInit JCR module .................. FAILURE [0.586s]
[INFO] Apache Sling RepoInit Integration Tests ........... SKIPPED
[INFO] Apache Sling RepoInit Reactor ..................... SKIPPED
[INFO] Apache Sling Test Tools ........................... SKIPPED
[INFO] Apache Sling Testing Clients ...................... SKIPPED
[INFO] Apache Sling Testing Hamcrest ..................... SKIPPED
[INFO] Apache Sling Server Setup Tools ................... SKIPPED
[INFO] Apache Sling Testing Rules ........................ SKIPPED
[INFO] Apache Sling JUnit Scriptable Tests Provider ...... SKIPPED
[INFO] Apache Sling JUnit Health Checks .................. SKIPPED
[INFO] Apache Sling JUnit Remote Tests Runners ........... SKIPPED
[INFO] Apache Sling JUnit Performance .................... SKIPPED
[INFO] Apache Sling Testing Mock Log Configuration ....... SKIPPED
[INFO] Apache Sling Testing Resource Resolver Mock ....... SKIPPED
[INFO] Apache Sling Testing JCR Mock ..................... SKIPPED
[INFO] Apache Sling Testing OSGi Mock .................... SKIPPED
[INFO] Apache Sling Testing Sling Mock ................... SKIPPED
[INFO] Apache Sling Testing Sling Mock Oak-based Resource Resolver  SKIPPED
[INFO] Apache Sling Testing Mocks Modules Reactor ........ SKIPPED
[INFO] Apache Sling Testing - sample bundle with integration tests  SKIPPED
[INFO] Apache Sling Testing - sample module with integration tests  SKIPPED
[INFO] Apache Sling Testing PaxExam ...................... SKIPPED
[INFO] Apache Sling Testing Modules Reactor .............. SKIPPED
[INFO] Apache Sling Installer ............................ SKIPPED
[INFO] Apache Sling File Installer ....................... SKIPPED
[INFO] Apache Sling JCR Installer ........................ SKIPPED
[INFO] Apache Sling Installer Configuration Admin Support  SKIPPED
[INFO] Apache Sling Deployment Package Installer ......... SKIPPED
[INFO] Apache Sling Subsystems Installer ................. SKIPPED
[INFO] Apache Sling Installer Integration Tests .......... SKIPPED
[INFO] Apache Sling Launchpad API ........................ SKIPPED
[INFO] Apache Sling Launchpad Installer .................. SKIPPED
[INFO] Apache Sling Launchpad Content .................... SKIPPED
[INFO] Apache Sling Validation Framework API ............. SKIPPED
[INFO] Apache Sling Validation Framework Core Implementation  SKIPPED
[INFO] Apache Sling Validation Framework Testing Services  SKIPPED
[INFO] Apache Sling Validation Framework Integration Tests  SKIPPED
[INFO] Apache Sling Validation Framework Examples ........ SKIPPED
[INFO] Apache Sling Validation Framework Builder ......... SKIPPED
[INFO] Apache Sling Models Validation Implementation ..... SKIPPED
[INFO] Apache Sling (Builder) ............................ SKIPPED
[INFO] ------------------------------------------------------------------------
[INFO] BUILD FAILURE
[INFO] ------------------------------------------------------------------------
[INFO] Total time: 59:57.052s
[INFO] Finished at: Wed Jul 06 19:56:05 UTC 2016
[INFO] Final Memory: 200M/392M
[INFO] ------------------------------------------------------------------------
[JENKINS] Archiving disabled
[JENKINS] Archiving disabled
[JENKINS] Archiving disabled
[JENKINS] Archiving disabled
[JENKINS] Archiving disabled
[JENKINS] Archiving disabled
[JENKINS] Archiving disabled
[JENKINS] Archiving disabled
[JENKINS] Archiving disabled
[JENKINS] Archiving disabled
[JENKINS] Archiving disabled
[JENKINS] Archiving disabled
[JENKINS] Archiving disabled
[JENKINS] Archiving disabled
[JENKINS] Archiving disabled
[JENKINS] Archiving disabled
[JENKINS] Archiving disabled
[JENKINS] Archiving disabled
[JENKINS] Archiving disabled
[JENKINS] Archiving disabled
[JENKINS] Archiving disabled
[JENKINS] Archiving disabled
[JENKINS] Archiving disabled
[JENKINS] Archiving disabled
[JENKINS] Archiving disabled
[JENKINS] Archiving disabled
[JENKINS] Archiving disabled
[JENKINS] Archiving disabled
[JENKINS] Archiving disabled
[JENKINS] Archiving disabled
[JENKINS] Archiving disabled
[JENKINS] Archiving disabled
[JENKINS] Archiving disabled
[JENKINS] Archiving disabled
[JENKINS] Archiving disabled
[JENKINS] Archiving disabled
[JENKINS] Archiving disabled
[JENKINS] Archiving disabled
[JENKINS] Archiving disabled
[JENKINS] Archiving disabled
[JENKINS] Archiving disabled
[JENKINS] Archiving disabled
[JENKINS] Archiving disabled
[JENKINS] Archiving disabled
[JENKINS] Archiving disabled
[JENKINS] Archiving disabled
[JENKINS] Archiving disabled
[JENKINS] Archiving disabled
[JENKINS] Archiving disabled
[JENKINS] Archiving disabled
[JENKINS] Archiving disabled
[JENKINS] Archiving disabled
[JENKINS] Archiving disabled
[JENKINS] Archiving disabled
[JENKINS] Archiving disabled
[JENKINS] Archiving disabled
[JENKINS] Archiving disabled
[JENKINS] Archiving disabled
[JENKINS] Archiving disabled
[JENKINS] Archiving disabled
[JENKINS] Archiving disabled
[JENKINS] Archiving disabled
[JENKINS] Archiving disabled
[JENKINS] Archiving disabled
[JENKINS] Archiving disabled
[JENKINS] Archiving disabled
[JENKINS] Archiving disabled
[JENKINS] Archiving disabled
[JENKINS] Archiving disabled
[JENKINS] Archiving disabled
[JENKINS] Archiving disabled
[JENKINS] Archiving disabled
[JENKINS] Archiving disabled
[JENKINS] Archiving disabled
[JENKINS] Archiving disabled
[JENKINS] Archiving disabled
[JENKINS] Archiving disabled
[JENKINS] Archiving disabled
[JENKINS] Archiving disabled
[JENKINS] Archiving disabled
[JENKINS] Archiving disabled
[JENKINS] Archiving disabled
[JENKINS] Archiving disabled
[JENKINS] Archiving disabled
[JENKINS] Archiving disabled
[JENKINS] Archiving disabled
[JENKINS] Archiving disabled
[JENKINS] Archiving disabled
[JENKINS] Archiving disabled
[JENKINS] Archiving disabled
[JENKINS] Archiving disabled
[JENKINS] Archiving disabled
[JENKINS] Archiving disabled
[JENKINS] Archiving disabled
[JENKINS] Archiving disabled
[JENKINS] Archiving disabled
[JENKINS] Archiving disabled
[JENKINS] Archiving disabled
[JENKINS] Archiving disabled
[JENKINS] Archiving disabled
[JENKINS] Archiving disabled
[JENKINS] Archiving disabled
[JENKINS] Archiving disabled
[JENKINS] Archiving disabled
[JENKINS] Archiving disabled
[JENKINS] Archiving disabled
[JENKINS] Archiving disabled
[JENKINS] Archiving disabled
[JENKINS] Archiving disabled
[JENKINS] Archiving disabled
[JENKINS] Archiving disabled
[JENKINS] Archiving disabled
[JENKINS] Archiving disabled
[JENKINS] Archiving disabled
[JENKINS] Archiving disabled
[JENKINS] Archiving disabled
[JENKINS] Archiving disabled
[JENKINS] Archiving disabled
[JENKINS] Archiving disabled
[JENKINS] Archiving disabled
[JENKINS] Archiving disabled
[JENKINS] Archiving disabled
[JENKINS] Archiving disabled
[JENKINS] Archiving disabled
[JENKINS] Archiving disabled
[JENKINS] Archiving disabled
[JENKINS] Archiving disabled
[JENKINS] Archiving disabled
[JENKINS] Archiving disabled
[JENKINS] Archiving disabled
[JENKINS] Archiving disabled
[JENKINS] Archiving disabled
[JENKINS] Archiving disabled
[JENKINS] Archiving disabled
[JENKINS] Archiving disabled
[JENKINS] Archiving disabled
[JENKINS] Archiving disabled
[JENKINS] Archiving disabled
[JENKINS] Archiving disabled
[JENKINS] Archiving disabled
Waiting for Jenkins to finish collecting data
[ERROR] Failed to execute goal on project org.apache.sling.jcr.repoinit: Could not resolve
dependencies for project org.apache.sling:org.apache.sling.jcr.repoinit:bundle:1.0.1-SNAPSHOT:
Could not find artifact org.apache.sling:org.apache.sling.repoinit.parser:jar:1.0.2 in central
(http://repo.maven.apache.org/maven2) -> [Help 1]
[ERROR] 
[ERROR] To see the full stack trace of the errors, re-run Maven with the -e switch.
[ERROR] Re-run Maven using the -X switch to enable full debug logging.
[ERROR] 
[ERROR] For more information about the errors and possible solutions, please read the following
articles:
[ERROR] [Help 1] http://cwiki.apache.org/confluence/display/MAVEN/DependencyResolutionException
[ERROR] 
[ERROR] After correcting the problems, you can resume the build with the command
[ERROR]   mvn <goals> -rf :org.apache.sling.jcr.repoinit
channel stopped

Mime
View raw message