sling-commits mailing list archives

Site index · List index
Message view « Date » · « Thread »
Top « Date » · « Thread »
From Apache Jenkins Server <jenk...@builds.apache.org>
Subject Build failed in Jenkins: sling-trunk-1.7 #4246
Date Thu, 07 Jul 2016 08:29:30 GMT
See <https://builds.apache.org/job/sling-trunk-1.7/4246/changes>

Changes:

[cziegeler] Fix javadoc package exclusion

[cziegeler] Fix some javadocs

[cziegeler] javadoc: replace @value with @link

------------------------------------------
[...truncated 12272 lines...]
A         testing/mocks/sling-mock-oak/src/test/java/org/apache/sling/testing/mock/sling/oak/resource/MultipleResourceResolverTest.java
A         testing/mocks/sling-mock-oak/pom.xml
A         testing/mocks/sling-mock-oak/README.txt
A         testing/sling-pax-util
A         testing/sling-pax-util/.gitignore
A         testing/sling-pax-util/src
A         testing/sling-pax-util/src/test
A         testing/sling-pax-util/src/test/java
A         testing/sling-pax-util/src/test/java/org
A         testing/sling-pax-util/src/test/java/org/apache
A         testing/sling-pax-util/src/test/java/org/apache/sling
A         testing/sling-pax-util/src/test/java/org/apache/sling/paxexam
A         testing/sling-pax-util/src/test/java/org/apache/sling/paxexam/util
A         testing/sling-pax-util/src/test/java/org/apache/sling/paxexam/util/IgnoredBundlesTest.java
AU        testing/sling-pax-util/src/test/java/org/apache/sling/paxexam/util/SlingRepositoryTest.java
A         testing/sling-pax-util/src/test/java/org/apache/sling/paxexam/util/SlingSetupTest.java
A         testing/sling-pax-util/src/main
A         testing/sling-pax-util/src/main/java
A         testing/sling-pax-util/src/main/java/org
A         testing/sling-pax-util/src/main/java/org/apache
A         testing/sling-pax-util/src/main/java/org/apache/sling
A         testing/sling-pax-util/src/main/java/org/apache/sling/paxexam
A         testing/sling-pax-util/src/main/java/org/apache/sling/paxexam/util
A         testing/sling-pax-util/src/main/java/org/apache/sling/paxexam/util/SlingPaxOptions.java
A         testing/sling-pax-util/pom.xml
A         testing/http
A         testing/http/clients
A         testing/http/clients/src
A         testing/http/clients/src/test
A         testing/http/clients/src/test/java
A         testing/http/clients/src/test/java/org
A         testing/http/clients/src/test/java/org/apache
A         testing/http/clients/src/test/java/org/apache/sling
A         testing/http/clients/src/test/java/org/apache/sling/testing
A         testing/http/clients/src/test/java/org/apache/sling/testing/DelayRequestInterceptorTest.java
A         testing/http/clients/src/test/java/org/apache/sling/testing/AbstractSlingClientGetServerUrlTest.java
A         testing/http/clients/src/test/java/org/apache/sling/testing/AbstractSlingClientGetPathTest.java
A         testing/http/clients/src/test/java/org/apache/sling/testing/util
A         testing/http/clients/src/test/java/org/apache/sling/testing/util/poller
A         testing/http/clients/src/test/java/org/apache/sling/testing/util/poller/AbstractPollerTest.java
A         testing/http/clients/src/test/java/org/apache/sling/testing/util/UniquePathsTest.java
A         testing/http/clients/src/test/java/org/apache/sling/testing/AbstractSlingClientGetUrlTest.java
A         testing/http/clients/src/main
A         testing/http/clients/src/main/java
A         testing/http/clients/src/main/java/org
A         testing/http/clients/src/main/java/org/apache
A         testing/http/clients/src/main/java/org/apache/sling
A         testing/http/clients/src/main/java/org/apache/sling/testing
A         testing/http/clients/src/main/java/org/apache/sling/testing/clients
A         testing/http/clients/src/main/java/org/apache/sling/testing/clients/AbstractSlingClient.java
A         testing/http/clients/src/main/java/org/apache/sling/testing/clients/SlingClientConfig.java
A         testing/http/clients/src/main/java/org/apache/sling/testing/clients/interceptors
A         testing/http/clients/src/main/java/org/apache/sling/testing/clients/interceptors/TestDescriptionInterceptor.java
A         testing/http/clients/src/main/java/org/apache/sling/testing/clients/interceptors/package-info.java
A         testing/http/clients/src/main/java/org/apache/sling/testing/clients/interceptors/DelayRequestInterceptor.java
A         testing/http/clients/src/main/java/org/apache/sling/testing/clients/interceptors/StickyCookieSpec.java
A         testing/http/clients/src/main/java/org/apache/sling/testing/clients/interceptors/StickyCookieHolder.java
A         testing/http/clients/src/main/java/org/apache/sling/testing/clients/interceptors/StickyCookieInterceptor.java
A         testing/http/clients/src/main/java/org/apache/sling/testing/clients/interceptors/TestDescriptionHolder.java
A         testing/http/clients/src/main/java/org/apache/sling/testing/clients/osgi
A         testing/http/clients/src/main/java/org/apache/sling/testing/clients/osgi/ComponentsInfo.java
A         testing/http/clients/src/main/java/org/apache/sling/testing/clients/osgi/Component.java
A         testing/http/clients/src/main/java/org/apache/sling/testing/clients/osgi/OsgiConsoleClient.java
A         testing/http/clients/src/main/java/org/apache/sling/testing/clients/osgi/package-info.java
A         testing/http/clients/src/main/java/org/apache/sling/testing/clients/osgi/BundleInfo.java
A         testing/http/clients/src/main/java/org/apache/sling/testing/clients/osgi/BundlesInfo.java
A         testing/http/clients/src/main/java/org/apache/sling/testing/clients/osgi/Bundle.java
A         testing/http/clients/src/main/java/org/apache/sling/testing/clients/osgi/BundlesInstaller.java
A         testing/http/clients/src/main/java/org/apache/sling/testing/clients/osgi/OsgiInstanceConfig.java
A         testing/http/clients/src/main/java/org/apache/sling/testing/clients/osgi/ComponentInfo.java
A         testing/http/clients/src/main/java/org/apache/sling/testing/clients/html
A         testing/http/clients/src/main/java/org/apache/sling/testing/clients/html/MicrodataClient.java
A         testing/http/clients/src/main/java/org/apache/sling/testing/clients/html/package-info.java
A         testing/http/clients/src/main/java/org/apache/sling/testing/clients/instance
A         testing/http/clients/src/main/java/org/apache/sling/testing/clients/instance/InstanceConfiguration.java
A         testing/http/clients/src/main/java/org/apache/sling/testing/clients/instance/InstanceSetup.java
A         testing/http/clients/src/main/java/org/apache/sling/testing/clients/package-info.java
A         testing/http/clients/src/main/java/org/apache/sling/testing/clients/SlingClient.java
A         testing/http/clients/src/main/java/org/apache/sling/testing/clients/SlingHttpResponse.java
A         testing/http/clients/src/main/java/org/apache/sling/testing/clients/Constants.java
A         testing/http/clients/src/main/java/org/apache/sling/testing/clients/ClientException.java
A         testing/http/clients/src/main/java/org/apache/sling/testing/clients/util
A         testing/http/clients/src/main/java/org/apache/sling/testing/clients/util/JsonUtils.java
A         testing/http/clients/src/main/java/org/apache/sling/testing/clients/util/URLParameterBuilder.java
A         testing/http/clients/src/main/java/org/apache/sling/testing/clients/util/SlingParameter.java
A         testing/http/clients/src/main/java/org/apache/sling/testing/clients/util/poller
A         testing/http/clients/src/main/java/org/apache/sling/testing/clients/util/poller/PathPoller.java
A         testing/http/clients/src/main/java/org/apache/sling/testing/clients/util/poller/Poller.java
A         testing/http/clients/src/main/java/org/apache/sling/testing/clients/util/poller/AbstractPoller.java
A         testing/http/clients/src/main/java/org/apache/sling/testing/clients/util/XSSUtils.java
A         testing/http/clients/src/main/java/org/apache/sling/testing/clients/util/HttpUtils.java
A         testing/http/clients/src/main/java/org/apache/sling/testing/clients/util/TimeoutsProvider.java
A         testing/http/clients/src/main/java/org/apache/sling/testing/clients/util/package-info.java
A         testing/http/clients/src/main/java/org/apache/sling/testing/clients/util/PortAllocator.java
A         testing/http/clients/src/main/java/org/apache/sling/testing/clients/util/ResourceUtil.java
A         testing/http/clients/src/main/java/org/apache/sling/testing/clients/util/config
A         testing/http/clients/src/main/java/org/apache/sling/testing/clients/util/config/package-info.java
A         testing/http/clients/src/main/java/org/apache/sling/testing/clients/util/config/InstanceConfigException.java
A         testing/http/clients/src/main/java/org/apache/sling/testing/clients/util/config/InstanceConfig.java
A         testing/http/clients/src/main/java/org/apache/sling/testing/clients/util/config/InstanceConfigCache.java
A         testing/http/clients/src/main/java/org/apache/sling/testing/clients/util/config/impl
A         testing/http/clients/src/main/java/org/apache/sling/testing/clients/util/config/impl/InstanceConfigCacheImpl.java
A         testing/http/clients/src/main/java/org/apache/sling/testing/clients/util/config/impl/EmptyInstanceConfig.java
A         testing/http/clients/src/main/java/org/apache/sling/testing/clients/util/UniquePaths.java
A         testing/http/clients/src/main/java/org/apache/sling/testing/clients/util/FormEntityBuilder.java
A         testing/http/clients/src/main/java/org/apache/sling/testing/clients/util/InputStreamBodyWithLength.java
A         testing/http/clients/src/main/java/org/apache/sling/testing/timeouts
A         testing/http/clients/src/main/java/org/apache/sling/testing/timeouts/TimeoutsProvider.java
A         testing/http/clients/pom.xml
A         testing/http/clients/README.md
A         testing/org.apache.sling.testing.paxexam
A         testing/org.apache.sling.testing.paxexam/src
A         testing/org.apache.sling.testing.paxexam/src/main
A         testing/org.apache.sling.testing.paxexam/src/main/java
A         testing/org.apache.sling.testing.paxexam/src/main/java/org
A         testing/org.apache.sling.testing.paxexam/src/main/java/org/apache
A         testing/org.apache.sling.testing.paxexam/src/main/java/org/apache/sling
A         testing/org.apache.sling.testing.paxexam/src/main/java/org/apache/sling/testing
A         testing/org.apache.sling.testing.paxexam/src/main/java/org/apache/sling/testing/paxexam
A         testing/org.apache.sling.testing.paxexam/src/main/java/org/apache/sling/testing/paxexam/SlingVersionResolver.java
A         testing/org.apache.sling.testing.paxexam/src/main/java/org/apache/sling/testing/paxexam/SlingOptions.java
A         testing/org.apache.sling.testing.paxexam/src/main/resources
A         testing/org.apache.sling.testing.paxexam/src/main/resources/templates
A         testing/org.apache.sling.testing.paxexam/src/main/resources/templates/SlingVersionResolver.txt
A         testing/org.apache.sling.testing.paxexam/src/main/resources/templates/SlingOptions.txt
A         testing/org.apache.sling.testing.paxexam/pom.xml
A         testing/org.apache.sling.testing.paxexam/README.md
A         testing/tools
A         testing/tools/src
A         testing/tools/src/test
A         testing/tools/src/test/java
A         testing/tools/src/test/java/org
A         testing/tools/src/test/java/org/apache
A         testing/tools/src/test/java/org/apache/sling
A         testing/tools/src/test/java/org/apache/sling/testing
A         testing/tools/src/test/java/org/apache/sling/testing/tools
A         testing/tools/src/test/java/org/apache/sling/testing/tools/sling
A         testing/tools/src/test/java/org/apache/sling/testing/tools/sling/SlingInstancesRuleTest.java
AU        testing/tools/src/test/java/org/apache/sling/testing/tools/sling/SlingClientTest.java
A         testing/tools/src/test/java/org/apache/sling/testing/tools/test
AU        testing/tools/src/test/java/org/apache/sling/testing/tools/test/ServerSetupSingletonTest.java
AU        testing/tools/src/test/java/org/apache/sling/testing/tools/test/TestSetupPhase.java
AU        testing/tools/src/test/java/org/apache/sling/testing/tools/test/TestServerSetup.java
A         testing/tools/src/main
A         testing/tools/src/main/java
A         testing/tools/src/main/java/org
A         testing/tools/src/main/java/org/apache
A         testing/tools/src/main/java/org/apache/sling
A         testing/tools/src/main/java/org/apache/sling/testing
A         testing/tools/src/main/java/org/apache/sling/testing/tools
A         testing/tools/src/main/java/org/apache/sling/testing/tools/retry
AU        testing/tools/src/main/java/org/apache/sling/testing/tools/retry/package-info.java
AU        testing/tools/src/main/java/org/apache/sling/testing/tools/retry/RetryLoop.java
A         testing/tools/src/main/java/org/apache/sling/testing/tools/serversetup
AU        testing/tools/src/main/java/org/apache/sling/testing/tools/serversetup/package-info.java
AU        testing/tools/src/main/java/org/apache/sling/testing/tools/serversetup/ServerSetup.java
AU        testing/tools/src/main/java/org/apache/sling/testing/tools/serversetup/ServerSetupSingleton.java
AU        testing/tools/src/main/java/org/apache/sling/testing/tools/serversetup/SetupPhase.java
AU        testing/tools/src/main/java/org/apache/sling/testing/tools/serversetup/StartRunnableJarPhase.java
A         testing/tools/src/main/java/org/apache/sling/testing/tools/junit
A         testing/tools/src/main/java/org/apache/sling/testing/tools/junit/TestDescriptionInterceptor.java
AU        testing/tools/src/main/java/org/apache/sling/testing/tools/junit/package-info.java
AU        testing/tools/src/main/java/org/apache/sling/testing/tools/junit/RemoteLogDumper.java
A         testing/tools/src/main/java/org/apache/sling/testing/tools/junit/TestDescriptionRule.java
A         testing/tools/src/main/java/org/apache/sling/testing/tools/junit/TestNameLoggingFilter.java
A         testing/tools/src/main/java/org/apache/sling/testing/tools/sling
AU        testing/tools/src/main/java/org/apache/sling/testing/tools/sling/SlingClient.java
A         testing/tools/src/main/java/org/apache/sling/testing/tools/sling/SlingInstanceManager.java
A         testing/tools/src/main/java/org/apache/sling/testing/tools/sling/SlingInstancesRule.java
A         testing/tools/src/main/java/org/apache/sling/testing/tools/sling/SlingInstance.java
A         testing/tools/src/main/java/org/apache/sling/testing/tools/sling/SlingInstanceState.java
AU        testing/tools/src/main/java/org/apache/sling/testing/tools/sling/TimeoutsProvider.java
AU        testing/tools/src/main/java/org/apache/sling/testing/tools/sling/package-info.java
AU        testing/tools/src/main/java/org/apache/sling/testing/tools/sling/SlingTestBase.java
AU        testing/tools/src/main/java/org/apache/sling/testing/tools/sling/BundlesInstaller.java
A         testing/tools/src/main/java/org/apache/sling/testing/tools/http
AU        testing/tools/src/main/java/org/apache/sling/testing/tools/http/Request.java
AU        testing/tools/src/main/java/org/apache/sling/testing/tools/http/RequestDocumentor.java
AU        testing/tools/src/main/java/org/apache/sling/testing/tools/http/RequestCustomizer.java
AU        testing/tools/src/main/java/org/apache/sling/testing/tools/http/RequestBuilder.java
AU        testing/tools/src/main/java/org/apache/sling/testing/tools/http/RetryingContentChecker.java
AU        testing/tools/src/main/java/org/apache/sling/testing/tools/http/package-info.java
AU        testing/tools/src/main/java/org/apache/sling/testing/tools/http/RequestExecutor.java
A         testing/tools/src/main/java/org/apache/sling/testing/tools/jarexec
AU        testing/tools/src/main/java/org/apache/sling/testing/tools/jarexec/JarExecutor.java
AU        testing/tools/src/main/java/org/apache/sling/testing/tools/jarexec/ShutdownHookSingleProcessDestroyer.java
AU        testing/tools/src/main/java/org/apache/sling/testing/tools/jarexec/package-info.java
A         testing/tools/src/main/java/org/apache/sling/testing/tools/osgi
AU        testing/tools/src/main/java/org/apache/sling/testing/tools/osgi/package-info.java
AU        testing/tools/src/main/java/org/apache/sling/testing/tools/osgi/WebconsoleClient.java
AU        testing/tools/pom.xml
A         .mvn
A         .mvn/jvm.config
 U        .
At revision 1751757

Parsing POMs
Downloaded artifact http://repo.maven.apache.org/maven2/org/apache/sling/sling/26/sling-26.pom
Downloaded artifact http://repo.maven.apache.org/maven2/org/apache/sling/sling/25/sling-25.pom
ERROR: Failed to parse POMs
java.io.IOException: remote file operation failed: <https://builds.apache.org/job/sling-trunk-1.7/ws/trunk>
at hudson.remoting.Channel@555b85dd:jenkins-test-71f: hudson.remoting.ProxyException: hudson.maven.MavenModuleSetBuild$MavenExecutionException:
org.apache.maven.project.ProjectBuildingException: Some problems were encountered while processing
the POMs:
[FATAL] Non-resolvable parent POM: Could not find artifact org.apache.sling:sling:pom:27-SNAPSHOT
and 'parent.relativePath' points at no local POM @ line 24, column 11

	at hudson.FilePath.act(FilePath.java:986)
	at hudson.FilePath.act(FilePath.java:968)
	at hudson.maven.MavenModuleSetBuild$MavenModuleSetBuildExecution.parsePoms(MavenModuleSetBuild.java:960)
	at hudson.maven.MavenModuleSetBuild$MavenModuleSetBuildExecution.doRun(MavenModuleSetBuild.java:679)
	at hudson.model.AbstractBuild$AbstractBuildExecution.run(AbstractBuild.java:534)
	at hudson.model.Run.execute(Run.java:1738)
	at hudson.maven.MavenModuleSetBuild.run(MavenModuleSetBuild.java:531)
	at hudson.model.ResourceController.execute(ResourceController.java:98)
	at hudson.model.Executor.run(Executor.java:410)
Caused by: hudson.remoting.ProxyException: hudson.maven.MavenModuleSetBuild$MavenExecutionException:
org.apache.maven.project.ProjectBuildingException: Some problems were encountered while processing
the POMs:
[FATAL] Non-resolvable parent POM: Could not find artifact org.apache.sling:sling:pom:27-SNAPSHOT
and 'parent.relativePath' points at no local POM @ line 24, column 11

	at hudson.maven.MavenModuleSetBuild$PomParser.invoke(MavenModuleSetBuild.java:1364)
	at hudson.maven.MavenModuleSetBuild$PomParser.invoke(MavenModuleSetBuild.java:1098)
	at hudson.FilePath$FileCallableWrapper.call(FilePath.java:2719)
	at hudson.remoting.UserRequest.perform(UserRequest.java:120)
	at hudson.remoting.UserRequest.perform(UserRequest.java:48)
	at hudson.remoting.Request$2.run(Request.java:326)
	at hudson.remoting.InterceptingExecutorService$1.call(InterceptingExecutorService.java:68)
	at java.util.concurrent.FutureTask.run(FutureTask.java:262)
	at java.util.concurrent.ThreadPoolExecutor.runWorker(ThreadPoolExecutor.java:1145)
	at java.util.concurrent.ThreadPoolExecutor$Worker.run(ThreadPoolExecutor.java:615)
	at java.lang.Thread.run(Thread.java:745)
	at ......remote call to jenkins-test-71f(Native Method)
	at hudson.remoting.Channel.attachCallSiteStackTrace(Channel.java:1416)
	at hudson.remoting.UserResponse.retrieve(UserRequest.java:220)
	at hudson.remoting.Channel.call(Channel.java:781)
	at hudson.FilePath.act(FilePath.java:979)
	... 8 more
Caused by: hudson.remoting.ProxyException: org.apache.maven.project.ProjectBuildingException:
Some problems were encountered while processing the POMs:
[FATAL] Non-resolvable parent POM: Could not find artifact org.apache.sling:sling:pom:27-SNAPSHOT
and 'parent.relativePath' points at no local POM @ line 24, column 11

	at org.apache.maven.project.DefaultProjectBuilder.build(DefaultProjectBuilder.java:364)
	at hudson.maven.MavenEmbedder.buildProjects(MavenEmbedder.java:361)
	at hudson.maven.MavenEmbedder.readProjects(MavenEmbedder.java:331)
	at hudson.maven.MavenModuleSetBuild$PomParser.invoke(MavenModuleSetBuild.java:1301)
	at hudson.maven.MavenModuleSetBuild$PomParser.invoke(MavenModuleSetBuild.java:1098)
	at hudson.FilePath$FileCallableWrapper.call(FilePath.java:2719)
	at hudson.remoting.UserRequest.perform(UserRequest.java:120)
	at hudson.remoting.UserRequest.perform(UserRequest.java:48)
	at hudson.remoting.Request$2.run(Request.java:326)
	at hudson.remoting.InterceptingExecutorService$1.call(InterceptingExecutorService.java:68)
	at java.util.concurrent.FutureTask.run(FutureTask.java:262)
	at java.util.concurrent.ThreadPoolExecutor.runWorker(ThreadPoolExecutor.java:1145)
	at java.util.concurrent.ThreadPoolExecutor$Worker.run(ThreadPoolExecutor.java:615)
	at java.lang.Thread.run(Thread.java:745)

Mime
View raw message