sling-commits mailing list archives

Site index · List index
Message view « Date » · « Thread »
Top « Date » · « Thread »
From Apache Jenkins Server <jenk...@builds.apache.org>
Subject Build failed in Jenkins: sling-trunk-1.8 #3615
Date Mon, 25 Jul 2016 13:51:24 GMT
See <https://builds.apache.org/job/sling-trunk-1.8/3615/changes>

Changes:

[olli] SLING-5897 Fail the test by default if there are unresolved bundles

[olli] SLING-3821 Run launchpad integration tests against Sling on Karaf

update TODOs (exclusions)

------------------------------------------
[...truncated 150024 lines...]
[JENKINS] Archiving disabled
[JENKINS] Archiving disabled
[JENKINS] Archiving disabled
[JENKINS] Archiving disabled
[JENKINS] Archiving disabled
[JENKINS] Archiving disabled
[JENKINS] Archiving disabled
[JENKINS] Archiving disabled
[JENKINS] Archiving disabled
[JENKINS] Archiving disabled
[JENKINS] Archiving disabled
[JENKINS] Archiving disabled
[JENKINS] Archiving disabled
[JENKINS] Archiving disabled
[JENKINS] Archiving disabled
[JENKINS] Archiving disabled
[JENKINS] Archiving disabled
[JENKINS] Archiving disabled
[JENKINS] Archiving disabled
[JENKINS] Archiving disabled
[JENKINS] Archiving disabled
[JENKINS] Archiving disabled
[JENKINS] Archiving disabled
[JENKINS] Archiving disabled
[JENKINS] Archiving disabled
[JENKINS] Archiving disabled
[JENKINS] Archiving disabled
[JENKINS] Archiving disabled
[JENKINS] Archiving disabled
[JENKINS] Archiving disabled
[JENKINS] Archiving disabled
[JENKINS] Archiving disabled
[JENKINS] Archiving disabled
[JENKINS] Archiving disabled
[JENKINS] Archiving disabled
[JENKINS] Archiving disabled
[JENKINS] Archiving disabled
[JENKINS] Archiving disabled
[JENKINS] Archiving disabled
[JENKINS] Archiving disabled
[JENKINS] Archiving disabled
[JENKINS] Archiving disabled
[JENKINS] Archiving disabled
[JENKINS] Archiving disabled
[JENKINS] Archiving disabled
[JENKINS] Archiving disabled
[JENKINS] Archiving disabled
[JENKINS] Archiving disabled
[JENKINS] Archiving disabled
[JENKINS] Archiving disabled
[JENKINS] Archiving disabled
[JENKINS] Archiving disabled
[JENKINS] Archiving disabled
[JENKINS] Archiving disabled
[JENKINS] Archiving disabled
[JENKINS] Archiving disabled
[JENKINS] Archiving disabled
[JENKINS] Archiving disabled
[JENKINS] Archiving disabled
[JENKINS] Archiving disabled
[JENKINS] Archiving disabled
[JENKINS] Archiving disabled
[JENKINS] Archiving disabled
[JENKINS] Archiving disabled
[JENKINS] Archiving disabled
[JENKINS] Archiving disabled
[JENKINS] Archiving disabled
[JENKINS] Archiving disabled
[JENKINS] Archiving disabled
[JENKINS] Archiving disabled
[JENKINS] Archiving disabled
[JENKINS] Archiving disabled
[JENKINS] Archiving disabled
[JENKINS] Archiving disabled
[JENKINS] Archiving disabled
[JENKINS] Archiving disabled
[JENKINS] Archiving disabled
[JENKINS] Archiving disabled
[JENKINS] Archiving disabled
[JENKINS] Archiving disabled[INFO] ------------------------------------------------------------------------
[INFO] Reactor Summary:
[INFO] 
[INFO] Apache Sling JAR Resource Bundle ................... SUCCESS [  2.997 s]
[INFO] Apache Sling (Parent) .............................. SUCCESS [  8.401 s]
[INFO] Apache Sling Tooling Support Install ............... SUCCESS [ 15.843 s]
[INFO] Apache Sling Provisioning Model .................... SUCCESS [ 11.088 s]
[INFO] Apache Sling Tooling Support Source ................ SUCCESS [  3.533 s]
[INFO] Apache Sling Testing Utilities ..................... SUCCESS [ 45.697 s]
[INFO] Apache Sling API ................................... SUCCESS [ 17.829 s]
[INFO] Apache Sling Resource Resolver ..................... SUCCESS [ 13.800 s]
[INFO] Apache Sling System Bundle Extension: Java Transaction API SUCCESS [ 10.480 s]
[INFO] Apache Sling System Bundle Extension: XML APIs ..... SUCCESS [ 10.273 s]
[INFO] Apache Sling System Bundle Extension: Activation API SUCCESS [ 17.767 s]
[INFO] Apache Sling System Bundle Extension: WS APIs ...... SUCCESS [  8.089 s]
[INFO] Apache Sling Dynamic Class Loader Support .......... SUCCESS [ 13.025 s]
[INFO] Apache Sling Commons FileSystem ClassLoader ........ SUCCESS [ 11.438 s]
[INFO] Apache Sling Commons Java Compiler ................. SUCCESS [  8.227 s]
[INFO] Apache Sling JSON Library .......................... SUCCESS [ 20.675 s]
[INFO] Apache Sling SLF4J Implementation (Logback) ........ SUCCESS [ 42.421 s]
[INFO] Apache Sling OSGi LogService Implementation ........ SUCCESS [  3.619 s]
[INFO] Apache Sling MIME type mapping support ............. SUCCESS [ 16.821 s]
[INFO] Apache Sling Content Detection Support ............. SUCCESS [01:12 min]
[INFO] Apache Sling Commons OSGi support .................. SUCCESS [  7.228 s]
[INFO] Apache Sling Scheduler Support ..................... SUCCESS [  8.268 s]
[INFO] Apache Sling Thread Dumper ......................... SUCCESS [ 12.510 s]
[INFO] Apache Sling Thread Support ........................ SUCCESS [ 14.312 s]
[INFO] Apache Sling Metrics ............................... SUCCESS [ 16.273 s]
[INFO] Apache Sling Authentication Service ................ SUCCESS [ 11.073 s]
[INFO] Apache Sling Form Based Authentication Handler ..... SUCCESS [ 16.681 s]
[INFO] Apache Sling Engine Implementation ................. SUCCESS [ 17.607 s]
[INFO] Apache Sling Repository API Bundle ................. SUCCESS [  4.337 s]
[INFO] Apache Sling JCR Base Bundle ....................... SUCCESS [ 10.077 s]
[INFO] Apache Sling Pax Exam Utilities .................... SUCCESS [01:09 min]
[INFO] Apache Sling Initial Content Loader ................ SUCCESS [02:02 min]
[INFO] Apache Sling Jackrabbit Embedded Repository ........ SUCCESS [ 19.918 s]
[INFO] Apache Sling Jackrabbit UserManager Support ........ SUCCESS [  8.626 s]
[INFO] Apache Sling Jackrabbit JSR-283 Access Control Manager Support SUCCESS [  3.056 s]
[INFO] Apache Sling Wrapper Bundle for the JCR API ........ SUCCESS [  2.743 s]
[INFO] Apache Sling JCR Resource Resolver ................. SUCCESS [02:13 min]
[INFO] Apache Sling Versioning Integration Tests .......... SUCCESS [ 34.055 s]
[INFO] Apache Sling JCR Repository Registration ........... SUCCESS [ 11.325 s]
[INFO] Apache Sling Simple WebDAV Access to repositories .. SUCCESS [  6.025 s]
[INFO] Apache Sling DavEx Access to repositories .......... SUCCESS [  9.296 s]
[INFO] Apache Sling JCR WebConsole Bundle ................. SUCCESS [  7.422 s]
[INFO] Apache Sling Oak Repository Server ................. SUCCESS [ 16.265 s]
[INFO] Apache Sling SlingRepository Integration Tests ..... SUCCESS [ 49.050 s]
[INFO] Apache Sling RepoInit Parser ....................... SUCCESS [ 25.351 s]
[INFO] Apache Sling RepoInit JCR module ................... SUCCESS [ 16.934 s]
[INFO] Apache Sling Servlet Resolver ...................... SUCCESS [ 30.672 s]
[INFO] Apache Sling Default GET Servlets .................. SUCCESS [  7.118 s]
[INFO] Apache Sling Default POST Servlets ................. SUCCESS [  7.255 s]
[INFO] Apache Sling Compat Servlets ....................... SUCCESS [  2.904 s]
[INFO] Apache Sling Scripting Implementation API .......... SUCCESS [  4.982 s]
[INFO] Apache Sling Scripting Core implementation ......... SUCCESS [ 21.456 s]
[INFO] Apache Sling Scripting JavaScript Support .......... SUCCESS [ 51.933 s]
[INFO] Apache Sling Scripting JSP Support ................. SUCCESS [ 11.354 s]
[INFO] Apache Sling JSP Tag Library ....................... SUCCESS [ 12.520 s]
[INFO] Apache Sling JSP Standard Tag Library .............. SUCCESS [ 11.653 s]
[INFO] Apache Sling Scripting Sightly Compiler ............ SUCCESS [ 22.711 s]
[INFO] Apache Sling Scripting Sightly Java Compiler ....... SUCCESS [ 17.980 s]
[INFO] Apache Sling Scripting Sightly Engine .............. SUCCESS [ 37.469 s]
[INFO] Apache Sling Scripting Sightly JavaScript Use Provider SUCCESS [  3.317 s]
[INFO] Apache Sling Scripting Sightly Models Use Provider . SUCCESS [ 12.517 s]
[INFO] Apache Sling Scripting Sightly Read-Eval-Print Loop Environment SUCCESS [  2.842 s]
[INFO] Apache Sling Scripting Sightly Integration Tests Content SUCCESS [  6.687 s]
[INFO] Apache Sling Launchpad Base ........................ SUCCESS [ 16.053 s]
[INFO] Apache Sling Subsystems Base Installer ............. SUCCESS [  9.529 s]
[INFO] Apache Sling Filesystem Resource Provider .......... SUCCESS [  8.997 s]
[INFO] Apache Sling Installer WebConsole Plugin ........... SUCCESS [  4.774 s]
[INFO] Apache Sling Launchpad Application Builder ......... SUCCESS [01:09 min]
[INFO] Apache Sling Scripting Sightly Integration Tests ... SUCCESS [02:06 min]
[INFO] Apache Sling Scripting Sightly Reactor ............. SUCCESS [  1.374 s]
[INFO] Apache Sling Adapter Manager Implementation ........ SUCCESS [ 11.887 s]
[INFO] Apache Sling Bundle Resource Provider .............. SUCCESS [  8.603 s]
[INFO] Apache Sling Distributed Event Admin ............... SUCCESS [  9.510 s]
[INFO] Apache Sling Discovery API ......................... SUCCESS [  7.794 s]
[INFO] Apache Sling Discovery Commons ..................... SUCCESS [01:06 min]
[INFO] Apache Sling Discovery Base ........................ SUCCESS [01:12 min]
[INFO] Apache Sling Resource-Based Discovery Service ...... SUCCESS [03:41 min]
[INFO] Apache Sling Oak-Based Discovery Service ........... SUCCESS [02:49 min]
[INFO] Apache Sling Discovery Support Bundle .............. SUCCESS [  3.709 s]
[INFO] Apache Sling Discovery Standalone Implementation ... SUCCESS [ 10.408 s]
[INFO] Apache Sling Event Support ......................... SUCCESS [13:18 min]
[INFO] Apache Sling Feature Flags ......................... SUCCESS [  3.604 s]
[INFO] Apache Sling javax.activation bundle ............... SUCCESS [  2.638 s]
[INFO] Apache Sling Service User Mapper ................... SUCCESS [  6.571 s]
[INFO] Apache Sling Settings .............................. SUCCESS [  6.314 s]
[INFO] Apache Sling Web Console Branding .................. SUCCESS [  4.091 s]
[INFO] Apache Sling Web Console Security Provider ......... SUCCESS [  2.918 s]
[INFO] Apache Sling Explorer .............................. SUCCESS [  7.619 s]
[INFO] Apache Sling Health Check Core ..................... SUCCESS [01:48 min]
[INFO] Apache Sling Health Check Samples .................. SUCCESS [ 21.170 s]
[INFO] Apache Sling Health Check Support Components ....... SUCCESS [ 24.295 s]
[INFO] Apache Sling Health Check Webconsole Plugin ........ SUCCESS [  7.569 s]
[INFO] Apache Sling Health Check JUnit Bridge ............. SUCCESS [ 12.773 s]
[INFO] Apache Sling Health Check Annotations .............. SUCCESS [  1.802 s]
[INFO] Apache Sling Health Check Integration Tests ........ SUCCESS [  5.692 s]
[INFO] Apache Sling Health Check Reactor POM .............. SUCCESS [  2.486 s]
[INFO] Apache Sling Resource Access Security .............. SUCCESS [ 11.496 s]
[INFO] Apache Sling Resource Access Security Integration Tests SUCCESS [ 50.816 s]
[INFO] Apache Sling Models API ............................ SUCCESS [  4.694 s]
[INFO] Apache Sling Models Implementation ................. SUCCESS [ 16.198 s]
[INFO] Apache Sling Models Integration Tests .............. SUCCESS [ 47.656 s]
[INFO] Apache Sling Internationalization Support .......... SUCCESS [01:28 min]
[INFO] Apache Sling XSS Protection Bundle ................. SUCCESS [ 18.339 s]
[INFO] Apache Sling JUnit Core ............................ SUCCESS [  9.727 s]
[INFO] Apache Sling JUnit Tests Teleporter ................ SUCCESS [  7.067 s]
[INFO] Apache Sling Resource Builder ...................... SUCCESS [ 48.622 s]
[INFO] Apache Sling Servlet Helpers ....................... SUCCESS [ 11.180 s]
[INFO] Apache Sling RepoInit Integration Tests ............ SUCCESS [ 19.273 s]
[INFO] Apache Sling RepoInit Reactor ...................... SUCCESS [  1.335 s]
[INFO] Apache Sling Test Tools ............................ SUCCESS [  3.639 s]
[INFO] Apache Sling Testing Clients ....................... SUCCESS [ 23.621 s]
[INFO] Apache Sling Testing Hamcrest ...................... SUCCESS [  2.919 s]
[INFO] Apache Sling Server Setup Tools .................... SUCCESS [  4.117 s]
[INFO] Apache Sling Testing Rules ......................... SUCCESS [02:13 min]
[INFO] Apache Sling JUnit Scriptable Tests Provider ....... SUCCESS [  3.366 s]
[INFO] Apache Sling JUnit Health Checks ................... SUCCESS [  4.493 s]
[INFO] Apache Sling JUnit Remote Tests Runners ............ SUCCESS [  5.181 s]
[INFO] Apache Sling JUnit Performance ..................... SUCCESS [  3.051 s]
[INFO] Apache Sling Testing Mock Log Configuration ........ SUCCESS [  2.638 s]
[INFO] Apache Sling Testing Resource Resolver Mock ........ SUCCESS [  3.057 s]
[INFO] Apache Sling Testing JCR Mock ...................... SUCCESS [  3.645 s]
[INFO] Apache Sling Testing OSGi Mock ..................... SUCCESS [  5.129 s]
[INFO] Apache Sling Testing Sling Mock .................... SUCCESS [ 11.292 s]
[INFO] Apache Sling Testing Sling Mock Oak-based Resource Resolver SUCCESS [ 25.421 s]
[INFO] Apache Sling Testing Mocks Modules Reactor ......... SUCCESS [  1.360 s]
[INFO] Apache Sling Testing - sample bundle with integration tests SUCCESS [ 51.932 s]
[INFO] Apache Sling Testing - sample module with integration tests SUCCESS [ 21.261 s]
[INFO] Apache Sling Testing PaxExam ....................... FAILURE [  7.984 s]
[INFO] Apache Sling Testing Modules Reactor ............... SKIPPED
[INFO] Apache Sling Installer ............................. SKIPPED
[INFO] Apache Sling File Installer ........................ SKIPPED
[INFO] Apache Sling JCR Installer ......................... SKIPPED
[INFO] Apache Sling Installer Configuration Admin Support . SKIPPED
[INFO] Apache Sling Deployment Package Installer .......... SKIPPED
[INFO] Apache Sling Subsystems Installer .................. SKIPPED
[INFO] Apache Sling Installer Integration Tests ........... SKIPPED
[INFO] Apache Sling Launchpad API ......................... SKIPPED
[INFO] Apache Sling Launchpad Installer ................... SKIPPED
[INFO] Apache Sling Launchpad Content ..................... SKIPPED
[INFO] Apache Sling Validation Framework API .............. SKIPPED
[INFO] Apache Sling Validation Framework Core Implementation SKIPPED
[INFO] Apache Sling Validation Framework Testing Services . SKIPPED
[INFO] Apache Sling Validation Framework Integration Tests  SKIPPED
[INFO] Apache Sling Validation Framework Examples ......... SKIPPED
[INFO] Apache Sling Validation Framework Builder .......... SKIPPED
[INFO] Apache Sling Models Validation Implementation ...... SKIPPED
[INFO] Apache Sling (Builder) ............................. SKIPPED
[INFO] ------------------------------------------------------------------------
[INFO] BUILD FAILURE
[INFO] ------------------------------------------------------------------------
[INFO] Total time: 01:04 h
[INFO] Finished at: 2016-07-25T13:50:08+00:00

[INFO] Final Memory: 380M/455M
[INFO] ------------------------------------------------------------------------
Waiting for Jenkins to finish collecting data
[ERROR] Failed to execute goal org.apache.maven.plugins:maven-source-plugin:3.0.0:jar (attach-sources)
on project org.apache.sling.testing.paxexam: Error creating source archive: Problem creating
jar: Execution exception: Java heap space -> [Help 1]
[ERROR] 
[ERROR] To see the full stack trace of the errors, re-run Maven with the -e switch.
[ERROR] Re-run Maven using the -X switch to enable full debug logging.
[ERROR] 
[ERROR] For more information about the errors and possible solutions, please read the following
articles:
[ERROR] [Help 1] http://cwiki.apache.org/confluence/display/MAVEN/MojoExecutionException
[ERROR] 
[ERROR] After correcting the problems, you can resume the build with the command
[ERROR]   mvn <goals> -rf :org.apache.sling.testing.paxexam
channel stopped

Mime
View raw message