sling-commits mailing list archives

Site index · List index
Message view « Date » · « Thread »
Top « Date » · « Thread »
From Apache Jenkins Server <jenk...@builds.apache.org>
Subject Build failed in Jenkins: sling-trunk-1.7 #4313
Date Sun, 17 Jul 2016 20:34:18 GMT
See <https://builds.apache.org/job/sling-trunk-1.7/4313/>

------------------------------------------
[...truncated 111936 lines...]
[INFO] Apache Sling Subsystems Base Installer ............ SUCCESS [16.195s]
[INFO] Apache Sling Filesystem Resource Provider ......... SUCCESS [9.728s]
[INFO] Apache Sling Installer WebConsole Plugin .......... SUCCESS [16.304s]
[INFO] Apache Sling Launchpad Application Builder ........ SUCCESS [1:04.333s]
[INFO] Apache Sling Scripting Sightly Integration Tests .. SUCCESS [3:18.644s]
[INFO] Apache Sling Scripting Sightly Reactor ............ SUCCESS [6.425s]
[INFO] Apache Sling Adapter Manager Implementation ....... SUCCESS [25.507s]
[INFO] Apache Sling Bundle Resource Provider ............. SUCCESS [12.898s]
[INFO] Apache Sling Distributed Event Admin .............. SUCCESS [10.965s]
[INFO] Apache Sling Discovery API ........................ SUCCESS [9.544s]
[INFO] Apache Sling Discovery Commons .................... SUCCESS [1:48.858s]
[INFO] Apache Sling Discovery Base ....................... SUCCESS [1:19.860s]
[INFO] Apache Sling Resource-Based Discovery Service ..... SUCCESS [4:14.618s]
[INFO] Apache Sling Oak-Based Discovery Service .......... SUCCESS [3:02.113s]
[INFO] Apache Sling Discovery Support Bundle ............. SUCCESS [6.035s]
[INFO] Apache Sling Discovery Standalone Implementation .. SUCCESS [24.197s]
[INFO] Apache Sling Event Support ........................ SUCCESS [14:04.981s]
[INFO] Apache Sling Feature Flags ........................ SUCCESS [46.688s]
[INFO] Apache Sling javax.activation bundle .............. SUCCESS [17.119s]
[INFO] Apache Sling Service User Mapper .................. SUCCESS [47.018s]
[INFO] Apache Sling Settings ............................. SUCCESS [17.063s]
[INFO] Apache Sling Web Console Branding ................. SUCCESS [27.582s]
[INFO] Apache Sling Web Console Security Provider ........ SUCCESS [9.020s]
[INFO] Apache Sling Explorer ............................. SUCCESS [4.695s]
[INFO] Apache Sling Health Check Core .................... SUCCESS [2:17.593s]
[INFO] Apache Sling Health Check Samples ................. SUCCESS [43.496s]
[INFO] Apache Sling Health Check Support Components ...... SUCCESS [18.550s]
[INFO] Apache Sling Health Check Webconsole Plugin ....... SUCCESS [27.903s]
[INFO] Apache Sling Health Check JUnit Bridge ............ SUCCESS [13.722s]
[INFO] Apache Sling Health Check Annotations ............. SUCCESS [9.010s]
[INFO] Apache Sling Health Check Integration Tests ....... SUCCESS [17.090s]
[INFO] Apache Sling Health Check Reactor POM ............. SUCCESS [24.236s]
[INFO] Apache Sling Resource Access Security ............. SUCCESS [9.972s]
[INFO] Apache Sling Resource Access Security Integration Tests  SUCCESS [1:08.037s]
[INFO] Apache Sling Models API ........................... SUCCESS [19.511s]
[INFO] Apache Sling Models Implementation ................ SUCCESS [1:02.899s]
[INFO] Apache Sling Models Integration Tests ............. SUCCESS [1:27.327s]
[INFO] Apache Sling Internationalization Support ......... FAILURE [1:16.966s]
[INFO] Apache Sling XSS Protection Bundle ................ SKIPPED
[INFO] Apache Sling JUnit Core ........................... SKIPPED
[INFO] Apache Sling JUnit Tests Teleporter ............... SKIPPED
[INFO] Apache Sling Resource Builder ..................... SKIPPED
[INFO] Apache Sling Servlet Helpers ...................... SKIPPED
[INFO] Apache Sling RepoInit Integration Tests ........... SKIPPED
[INFO] Apache Sling RepoInit Reactor ..................... SKIPPED
[INFO] Apache Sling Test Tools ........................... SKIPPED
[INFO] Apache Sling Testing Clients ...................... SKIPPED
[INFO] Apache Sling Testing Hamcrest ..................... SKIPPED
[INFO] Apache Sling Server Setup Tools ................... SKIPPED
[INFO] Apache Sling Testing Rules ........................ SKIPPED
[INFO] Apache Sling JUnit Scriptable Tests Provider ...... SKIPPED
[INFO] Apache Sling JUnit Health Checks .................. SKIPPED
[INFO] Apache Sling JUnit Remote Tests Runners ........... SKIPPED
[INFO] Apache Sling JUnit Performance .................... SKIPPED
[INFO] Apache Sling Testing Mock Log Configuration ....... SKIPPED
[INFO] Apache Sling Testing Resource Resolver Mock ....... SKIPPED
[INFO] Apache Sling Testing JCR Mock ..................... SKIPPED
[INFO] Apache Sling Testing OSGi Mock .................... SKIPPED
[INFO] Apache Sling Testing Sling Mock ................... SKIPPED
[INFO] Apache Sling Testing Sling Mock Oak-based Resource Resolver  SKIPPED
[INFO] Apache Sling Testing Mocks Modules Reactor ........ SKIPPED
[INFO] Apache Sling Testing - sample bundle with integration tests  SKIPPED
[INFO] Apache Sling Testing - sample module with integration tests  SKIPPED
[INFO] Apache Sling Testing PaxExam ...................... SKIPPED
[INFO] Apache Sling Testing Modules Reactor .............. SKIPPED
[INFO] Apache Sling Installer ............................ SKIPPED
[INFO] Apache Sling File Installer ....................... SKIPPED
[INFO] Apache Sling JCR Installer ........................ SKIPPED
[INFO] Apache Sling Installer Configuration Admin Support  SKIPPED
[INFO] Apache Sling Deployment Package Installer ......... SKIPPED
[INFO] Apache Sling Subsystems Installer ................. SKIPPED
[INFO] Apache Sling Installer Integration Tests .......... SKIPPED
[INFO] Apache Sling Launchpad API ........................ SKIPPED
[INFO] Apache Sling Launchpad Installer .................. SKIPPED
[INFO] Apache Sling Launchpad Content .................... SKIPPED
[INFO] Apache Sling Launchpad Testing Services ........... SKIPPED
[INFO] Apache Sling Launchpad Testing Services WAR ....... SKIPPED
[INFO] Apache Sling Launchpad Testing Fragment Bundle .... SKIPPED
[INFO] Apache Sling Launchpad Test Bundles ............... SKIPPED
[INFO] Apache Sling Integration Tests .................... SKIPPED
[INFO] Apache Sling Launchpad Testing .................... SKIPPED
[INFO] Apache Sling (Builder) ............................ SKIPPED
[INFO] ------------------------------------------------------------------------
[INFO] BUILD FAILURE
[INFO] ------------------------------------------------------------------------
[INFO] Total time: 1:32:00.745s
[INFO] Finished at: Sun Jul 17 20:28:19 UTC 2016
[INFO] Final Memory: 190M/335M
[INFO] ------------------------------------------------------------------------
[JENKINS] Archiving disabled
[JENKINS] Archiving disabled
[JENKINS] Archiving disabled
[JENKINS] Archiving disabled
[JENKINS] Archiving disabled
[JENKINS] Archiving disabled
[JENKINS] Archiving disabled
[JENKINS] Archiving disabled
[JENKINS] Archiving disabled
[JENKINS] Archiving disabled
[JENKINS] Archiving disabled
[JENKINS] Archiving disabled
[JENKINS] Archiving disabled
[JENKINS] Archiving disabled
[JENKINS] Archiving disabled
[JENKINS] Archiving disabled
[JENKINS] Archiving disabled
[JENKINS] Archiving disabled
[JENKINS] Archiving disabled
[JENKINS] Archiving disabled
[JENKINS] Archiving disabled
[JENKINS] Archiving disabled
[JENKINS] Archiving disabled
[JENKINS] Archiving disabled
[JENKINS] Archiving disabled
[JENKINS] Archiving disabled
[JENKINS] Archiving disabled
[JENKINS] Archiving disabled
[JENKINS] Archiving disabled
[JENKINS] Archiving disabled
[JENKINS] Archiving disabled
[JENKINS] Archiving disabled
[JENKINS] Archiving disabled
[JENKINS] Archiving disabled
[JENKINS] Archiving disabled
[JENKINS] Archiving disabled
[JENKINS] Archiving disabled
[JENKINS] Archiving disabled
[JENKINS] Archiving disabled
[JENKINS] Archiving disabled
[JENKINS] Archiving disabled
[JENKINS] Archiving disabled
[JENKINS] Archiving disabled
[JENKINS] Archiving disabled
[JENKINS] Archiving disabled
[JENKINS] Archiving disabled
[JENKINS] Archiving disabled
[JENKINS] Archiving disabled
[JENKINS] Archiving disabled
[JENKINS] Archiving disabled
[JENKINS] Archiving disabled
[JENKINS] Archiving disabled
[JENKINS] Archiving disabled
[JENKINS] Archiving disabled
[JENKINS] Archiving disabled
[JENKINS] Archiving disabled
[JENKINS] Archiving disabled
[JENKINS] Archiving disabled
[JENKINS] Archiving disabled
[JENKINS] Archiving disabled
[JENKINS] Archiving disabled
[JENKINS] Archiving disabled
[JENKINS] Archiving disabled
[JENKINS] Archiving disabled
[JENKINS] Archiving disabled
[JENKINS] Archiving disabled
[JENKINS] Archiving disabled
[JENKINS] Archiving disabled
[JENKINS] Archiving disabled
[JENKINS] Archiving disabled
[JENKINS] Archiving disabled
[JENKINS] Archiving disabled
[JENKINS] Archiving disabled
[JENKINS] Archiving disabled
[JENKINS] Archiving disabled
[JENKINS] Archiving disabled
[JENKINS] Archiving disabled
[JENKINS] Archiving disabled
[JENKINS] Archiving disabled
[JENKINS] Archiving disabled
[JENKINS] Archiving disabled
[JENKINS] Archiving disabled
[JENKINS] Archiving disabled
[JENKINS] Archiving disabled
[JENKINS] Archiving disabled
[JENKINS] Archiving disabled
[JENKINS] Archiving disabled
[JENKINS] Archiving disabled
[JENKINS] Archiving disabled
[JENKINS] Archiving disabled
[JENKINS] Archiving disabled
[JENKINS] Archiving disabled
[JENKINS] Archiving disabled
[JENKINS] Archiving disabled
[JENKINS] Archiving disabled
[JENKINS] Archiving disabled
[JENKINS] Archiving disabled
[JENKINS] Archiving disabled
[JENKINS] Archiving disabled
[JENKINS] Archiving disabled
[JENKINS] Archiving disabled
[JENKINS] Archiving disabled
[JENKINS] Archiving disabled
[JENKINS] Archiving disabled
[JENKINS] Archiving disabled
[JENKINS] Archiving disabled
[JENKINS] Archiving disabled
[JENKINS] Archiving disabled
[JENKINS] Archiving disabled
[JENKINS] Archiving disabled
[JENKINS] Archiving disabled
[JENKINS] Archiving disabled
[JENKINS] Archiving disabled
[JENKINS] Archiving disabled
[JENKINS] Archiving disabled
[JENKINS] Archiving disabled
[JENKINS] Archiving disabled
[JENKINS] Archiving disabled
[JENKINS] Archiving disabled
[JENKINS] Archiving disabled
[JENKINS] Archiving disabled
[JENKINS] Archiving disabled
[JENKINS] Archiving disabled
[JENKINS] Archiving disabled
[JENKINS] Archiving disabled
[JENKINS] Archiving disabled
[JENKINS] Archiving disabled
[JENKINS] Archiving disabled
[JENKINS] Archiving disabled
[JENKINS] Archiving disabled
[JENKINS] Archiving disabled
[JENKINS] Archiving disabled
[JENKINS] Archiving disabled
[JENKINS] Archiving disabled
[JENKINS] Archiving disabled
[JENKINS] Archiving disabled
[JENKINS] Archiving disabled
[JENKINS] Archiving disabled
[JENKINS] Archiving disabled
[JENKINS] Archiving disabled
[JENKINS] Archiving disabled
[JENKINS] Archiving disabled
[JENKINS] Archiving disabled
[JENKINS] Archiving disabled
[JENKINS] Archiving disabled
[JENKINS] Archiving disabled
Waiting for Jenkins to finish collecting data
[ERROR] Failed to execute goal org.apache.maven.plugins:maven-failsafe-plugin:2.18.1:integration-test
(default) on project org.apache.sling.i18n: Execution default of goal org.apache.maven.plugins:maven-failsafe-plugin:2.18.1:integration-test
failed: The forked VM terminated without properly saying goodbye. VM crash or System.exit
called?
[ERROR] Command was /bin/sh -c cd <https://builds.apache.org/job/sling-trunk-1.7/ws/trunk/bundles/extensions/i18n>
&& /usr/lib/jvm/java-7-openjdk-amd64/jre/bin/java -jar <https://builds.apache.org/job/sling-trunk-1.7/ws/trunk/bundles/extensions/i18n/target/surefire/surefirebooter2443573406663415698.jar>
<https://builds.apache.org/job/sling-trunk-1.7/ws/trunk/bundles/extensions/i18n/target/surefire/surefire3269313249928014373tmp>
<https://builds.apache.org/job/sling-trunk-1.7/ws/trunk/bundles/extensions/i18n/target/surefire/surefire_88106509603784732074tmp>
[ERROR] -> [Help 1]
[ERROR] 
[ERROR] To see the full stack trace of the errors, re-run Maven with the -e switch.
[ERROR] Re-run Maven using the -X switch to enable full debug logging.
[ERROR] 
[ERROR] For more information about the errors and possible solutions, please read the following
articles:
[ERROR] [Help 1] http://cwiki.apache.org/confluence/display/MAVEN/PluginExecutionException
[ERROR] 
[ERROR] After correcting the problems, you can resume the build with the command
[ERROR]   mvn <goals> -rf :org.apache.sling.i18n
channel stopped

Mime
View raw message