sling-commits mailing list archives

Site index · List index
Message view « Date » · « Thread »
Top « Date » · « Thread »
From Apache Jenkins Server <jenk...@builds.apache.org>
Subject Build failed in Jenkins: sling-contrib-1.7 #990
Date Tue, 12 Jul 2016 10:58:58 GMT
See <https://builds.apache.org/job/sling-contrib-1.7/990/changes>

Changes:

[olli] do not keep caches

------------------------------------------
[...truncated 12055 lines...]
Downloading: http://repository.apache.org/snapshots/org/apache/sling/org.apache.sling.launchpad.karaf-features/0.1.1-SNAPSHOT/maven-metadata.xml
Downloaded: http://repository.apache.org/snapshots/org/apache/sling/org.apache.sling.launchpad.karaf-features/0.1.1-SNAPSHOT/maven-metadata.xml
(2 KB at 1.7 KB/sec)
[INFO] Generating feature descriptor file <https://builds.apache.org/job/sling-contrib-1.7/ws/trunk/launchpad/karaf/org.apache.sling.launchpad.karaf-features/target/feature/feature.xml>
[INFO] ...done!
[INFO] 
[INFO] --- karaf-maven-plugin:4.0.5:features-generate-descriptor (generate-features-file)
@ org.apache.sling.launchpad.karaf-features ---
[INFO] Generating feature descriptor file <https://builds.apache.org/job/sling-contrib-1.7/ws/trunk/launchpad/karaf/org.apache.sling.launchpad.karaf-features/target/feature/feature.xml>
[INFO] ...done!
[WARNING] Artifact org.apache.sling:org.apache.sling.launchpad.karaf-features:xml:features:0.1.1-SNAPSHOT
already attached to project, ignoring duplicate
[INFO] 
[INFO] --- animal-sniffer-maven-plugin:1.14:check (default) @ org.apache.sling.launchpad.karaf-features
---
[INFO] Checking unresolved references to org.codehaus.mojo.signature:java16:1.0
[INFO] 
[INFO] --- maven-enforcer-plugin:1.3.1:enforce (enforce-java) @ org.apache.sling.launchpad.karaf-features
---
[INFO] 
[INFO] --- maven-antrun-plugin:1.8:run (set-bundle-required-execution-environment) @ org.apache.sling.launchpad.karaf-features
---
[INFO] Executing tasks

main:
[INFO] Executed tasks
[WARNING] Failed to getClass for org.apache.maven.plugin.source.SourceJarMojo
[INFO] 
[INFO] --- maven-source-plugin:2.4:jar (attach-sources) @ org.apache.sling.launchpad.karaf-features
---
[INFO] Building jar: <https://builds.apache.org/job/sling-contrib-1.7/ws/trunk/launchpad/karaf/org.apache.sling.launchpad.karaf-features/target/org.apache.sling.launchpad.karaf-features-0.1.1-SNAPSHOT-sources.jar>
[INFO] 
[INFO] --- karaf-maven-plugin:4.0.5:kar (features-create-kar) @ org.apache.sling.launchpad.karaf-features
---
Downloading: http://repository.apache.org/snapshots/org/apache/sling/org.apache.sling.api/2.11.1-SNAPSHOT/maven-metadata.xml
Downloaded: http://repository.apache.org/snapshots/org/apache/sling/org.apache.sling.api/2.11.1-SNAPSHOT/maven-metadata.xml
(1012 B at 0.1 KB/sec)
Downloading: http://repository.apache.org/snapshots/org/apache/sling/org.apache.sling.commons.messaging/0.0.1-SNAPSHOT/maven-metadata.xml
Downloaded: http://repository.apache.org/snapshots/org/apache/sling/org.apache.sling.commons.messaging/0.0.1-SNAPSHOT/maven-metadata.xml
(1014 B at 1.9 KB/sec)
Downloading: http://repository.apache.org/snapshots/org/apache/sling/org.apache.sling.commons.messaging.mail/0.0.1-SNAPSHOT/maven-metadata.xml
Downloaded: http://repository.apache.org/snapshots/org/apache/sling/org.apache.sling.commons.messaging.mail/0.0.1-SNAPSHOT/maven-metadata.xml
(1019 B at 1.9 KB/sec)
Downloading: http://repository.apache.org/snapshots/org/apache/sling/org.apache.sling.discovery.base/1.1.3-SNAPSHOT/maven-metadata.xml
Downloaded: http://repository.apache.org/snapshots/org/apache/sling/org.apache.sling.discovery.base/1.1.3-SNAPSHOT/maven-metadata.xml
(2 KB at 1.7 KB/sec)
Downloading: http://repository.apache.org/snapshots/org/apache/sling/org.apache.sling.discovery.base/1.1.3-SNAPSHOT/org.apache.sling.discovery.base-1.1.3-20160712.101730-1264.jar
Downloaded: http://repository.apache.org/snapshots/org/apache/sling/org.apache.sling.discovery.base/1.1.3-SNAPSHOT/org.apache.sling.discovery.base-1.1.3-20160712.101730-1264.jar
(83 KB at 78.4 KB/sec)
Downloading: http://repository.apache.org/snapshots/org/apache/sling/org.apache.sling.discovery.impl/1.2.7-SNAPSHOT/maven-metadata.xml
Downloaded: http://repository.apache.org/snapshots/org/apache/sling/org.apache.sling.discovery.impl/1.2.7-SNAPSHOT/maven-metadata.xml
(1023 B at 1.4 KB/sec)
Downloading: http://repository.apache.org/snapshots/org/apache/sling/org.apache.sling.discovery.impl/1.2.7-SNAPSHOT/org.apache.sling.discovery.impl-1.2.7-20160712.102021-1268.jar
Downloaded: http://repository.apache.org/snapshots/org/apache/sling/org.apache.sling.discovery.impl/1.2.7-SNAPSHOT/org.apache.sling.discovery.impl-1.2.7-20160712.102021-1268.jar
(106 KB at 86.8 KB/sec)
Downloading: http://repository.apache.org/snapshots/org/apache/sling/org.apache.sling.discovery.oak/1.2.7-SNAPSHOT/maven-metadata.xml
Downloaded: http://repository.apache.org/snapshots/org/apache/sling/org.apache.sling.discovery.oak/1.2.7-SNAPSHOT/maven-metadata.xml
(1018 B at 1.4 KB/sec)
Downloading: http://repository.apache.org/snapshots/org/apache/sling/org.apache.sling.discovery.oak/1.2.7-SNAPSHOT/org.apache.sling.discovery.oak-1.2.7-20160712.102325-778.jar
Downloaded: http://repository.apache.org/snapshots/org/apache/sling/org.apache.sling.discovery.oak/1.2.7-SNAPSHOT/org.apache.sling.discovery.oak-1.2.7-20160712.102325-778.jar
(75 KB at 71.4 KB/sec)
Downloading: http://repository.apache.org/snapshots/org/apache/sling/org.apache.sling.validation.api/1.0.0-SNAPSHOT/maven-metadata.xml
Downloaded: http://repository.apache.org/snapshots/org/apache/sling/org.apache.sling.validation.api/1.0.0-SNAPSHOT/maven-metadata.xml
(1023 B at 1.5 KB/sec)
Downloading: http://repository.apache.org/snapshots/org/apache/sling/org.apache.sling.validation.core/1.0.0-SNAPSHOT/maven-metadata.xml
Downloaded: http://repository.apache.org/snapshots/org/apache/sling/org.apache.sling.validation.core/1.0.0-SNAPSHOT/maven-metadata.xml
(1 KB at 1.4 KB/sec)
Downloading: http://repository.apache.org/snapshots/org/apache/sling/org.apache.sling.jcr.oak.server/1.0.1-SNAPSHOT/maven-metadata.xml
Downloaded: http://repository.apache.org/snapshots/org/apache/sling/org.apache.sling.jcr.oak.server/1.0.1-SNAPSHOT/maven-metadata.xml
(1023 B at 1.4 KB/sec)
Downloading: http://repository.apache.org/snapshots/org/apache/sling/org.apache.sling.jcr.oak.server/1.0.1-SNAPSHOT/org.apache.sling.jcr.oak.server-1.0.1-20160712.100428-1647.jar
Downloaded: http://repository.apache.org/snapshots/org/apache/sling/org.apache.sling.jcr.oak.server/1.0.1-SNAPSHOT/org.apache.sling.jcr.oak.server-1.0.1-20160712.100428-1647.jar
(29 KB at 36.7 KB/sec)
Downloading: http://repo.maven.apache.org/maven2/org/apache/jackrabbit/oak-segment/1.5.5/oak-segment-1.5.5.jar
Downloaded: http://repo.maven.apache.org/maven2/org/apache/jackrabbit/oak-segment/1.5.5/oak-segment-1.5.5.jar
(316 KB at 1056.4 KB/sec)
Downloading: http://repository.apache.org/snapshots/org/apache/sling/org.apache.sling.scripting.core/2.0.37-SNAPSHOT/maven-metadata.xml
Downloaded: http://repository.apache.org/snapshots/org/apache/sling/org.apache.sling.scripting.core/2.0.37-SNAPSHOT/maven-metadata.xml
(1023 B at 1.4 KB/sec)
Downloading: http://repository.apache.org/snapshots/org/apache/sling/org.apache.sling.scripting.core/2.0.37-SNAPSHOT/org.apache.sling.scripting.core-2.0.37-20160709.180001-747.jar
Downloaded: http://repository.apache.org/snapshots/org/apache/sling/org.apache.sling.scripting.core/2.0.37-SNAPSHOT/org.apache.sling.scripting.core-2.0.37-20160709.180001-747.jar
(81 KB at 72.3 KB/sec)
Downloading: http://repository.apache.org/snapshots/org/apache/sling/org.apache.sling.servlets.resolver/2.4.3-SNAPSHOT/maven-metadata.xml
Downloaded: http://repository.apache.org/snapshots/org/apache/sling/org.apache.sling.servlets.resolver/2.4.3-SNAPSHOT/maven-metadata.xml
(1022 B at 1.4 KB/sec)
Downloading: http://repository.apache.org/snapshots/org/apache/sling/org.apache.sling.servlets.resolver/2.4.3-SNAPSHOT/org.apache.sling.servlets.resolver-2.4.3-20160709.192252-706.jar
Downloaded: http://repository.apache.org/snapshots/org/apache/sling/org.apache.sling.servlets.resolver/2.4.3-SNAPSHOT/org.apache.sling.servlets.resolver-2.4.3-20160709.192252-706.jar
(67 KB at 64.1 KB/sec)
Downloading: http://repository.apache.org/snapshots/org/apache/sling/org.apache.sling.hc.core/1.2.5-SNAPSHOT/maven-metadata.xml
Downloaded: http://repository.apache.org/snapshots/org/apache/sling/org.apache.sling.hc.core/1.2.5-SNAPSHOT/maven-metadata.xml
(1012 B at 1.6 KB/sec)
Downloading: http://repository.apache.org/snapshots/org/apache/sling/org.apache.sling.hc.core/1.2.5-SNAPSHOT/org.apache.sling.hc.core-1.2.5-20160712.103842-582.jar
Downloaded: http://repository.apache.org/snapshots/org/apache/sling/org.apache.sling.hc.core/1.2.5-SNAPSHOT/org.apache.sling.hc.core-1.2.5-20160712.103842-582.jar
(109 KB at 90.0 KB/sec)
Downloading: http://repository.apache.org/snapshots/org/apache/sling/org.apache.sling.scripting.freemarker/1.0.0-SNAPSHOT/maven-metadata.xml
Downloading: http://repository.apache.org/snapshots/org/apache/sling/org.apache.sling.scripting.freemarker/1.0.0-SNAPSHOT/org.apache.sling.scripting.freemarker-1.0.0-SNAPSHOT.jar
[JENKINS] Archiving disabled
[INFO] ------------------------------------------------------------------------
[INFO] Reactor Summary:
[INFO] 
[INFO] Apache Sling Authentication XING API .............. SUCCESS [23.343s]
[INFO] Apache Sling Authentication XING Login ............ SUCCESS [9.576s]
[INFO] Apache Sling Authentication XING OAuth ............ SUCCESS [5.563s]
[INFO] Apache Sling Commons HTML Utilities ............... SUCCESS [4.834s]
[INFO] Apache Sling APT parser ........................... SUCCESS [25.095s]
[INFO] Apache Sling APT servlet .......................... SUCCESS [4.925s]
[INFO] Apache Sling Resource Collection API .............. SUCCESS [5.641s]
[INFO] Apache Sling DataSource Provider .................. SUCCESS [14.132s]
[INFO] Apache Sling Dojo JavaScript Library .............. SUCCESS [9.188s]
[INFO] Apache Sling Dojo Data Extension .................. SUCCESS [9.346s]
[INFO] Apache Sling FTP Server ........................... SUCCESS [22.378s]
[INFO] Apache Sling Google Web Toolkit Servlet Library ... SUCCESS [5.919s]
[INFO] Apache Sling Google Web Toolkit Sample ............ SUCCESS [44.219s]
[INFO] Apache Sling JMX Resource Provider ................ SUCCESS [20.724s]
[INFO] Apache Sling ClassLoader Leak Detector ............ SUCCESS [6.943s]
[INFO] Apache Sling MongoDB Resource Provider ............ SUCCESS [5.003s]
[INFO] Apache Sling OSGi Bundle Repository ............... SUCCESS [8.981s]
[INFO] Apache Sling Distribution API ..................... SUCCESS [8.047s]
[INFO] Apache Sling Distribution Core .................... SUCCESS [35.949s]
[INFO] Apache Sling Distribution Extensions .............. SUCCESS [11.906s]
[INFO] Apache Sling Distribution Sample .................. SUCCESS [3.693s]
[INFO] Apache Sling Distribution Integration Tests ....... SUCCESS [15:03.463s]
[INFO] Apache Sling Log Tail Implementation .............. SUCCESS [12.908s]
[INFO] S3 dependencies for Oak ........................... SUCCESS [12.223s]
[INFO] Apache Sling Request Processing Analyzer .......... SUCCESS [6.708s]
[INFO] Apache Sling Resource Merger ...................... SUCCESS [8.163s]
[INFO] Apache Sling Inventory Printer Based on Resources . SUCCESS [2.836s]
[INFO] Apache Sling Rewriter ............................. SUCCESS [14.965s]
[INFO] Apache Sling Security ............................. SUCCESS [18.456s]
[INFO] Apache Sling SLF4J MDC Filter ..................... SUCCESS [12.684s]
[INFO] Apache Sling Query ................................ SUCCESS [5.903s]
[INFO] Apache Sling Oak Restrictions ..................... SUCCESS [7.563s]
[INFO] Apache Sling Superimposing Resource Provider ...... SUCCESS [13.309s]
[INFO] Apache Sling Tenant ............................... SUCCESS [10.392s]
[INFO] Apache Sling Log Tracer ........................... SUCCESS [9.859s]
[INFO] Apache Sling URL Rewriter ......................... SUCCESS [12.265s]
[INFO] HApi - Sling Hypermedia API tools ................. SUCCESS [8.141s]
[INFO] HApi - Sling Hypermedia API client-side tools ..... SUCCESS [12.082s]
[INFO] HApi - Sample Content ............................. SUCCESS [4.505s]
[INFO] HApi - Sling Hypermedia API Tools Reactor ......... SUCCESS [6.525s]
[INFO] Apache Sling Dynamic Include ...................... SUCCESS [3.125s]
[INFO] Apache Sling JCR Java Compiler .................... SUCCESS [24.939s]
[INFO] Apache Sling Repository Accessor .................. SUCCESS [3.774s]
[INFO] Apache Sling Object Content Mapping ............... SUCCESS [8.181s]
[INFO] Apache Sling JCR Prefs ............................ SUCCESS [4.791s]
[INFO] Apache Sling JCR Resource Security ................ SUCCESS [3.303s]
[INFO] Apache Sling Script Console ....................... SUCCESS [4.862s]
[INFO] Apache Sling Atom Tag Library ..................... SUCCESS [5.332s]
[INFO] Apache Sling Scripting Groovy Support ............. SUCCESS [9.559s]
[INFO] Apache Sling Scripting Java Support ............... SUCCESS [11.324s]
[INFO] Apache Sling Scripting JST Support ................ SUCCESS [9.656s]
[INFO] Apache Sling Scripting Python Support ............. SUCCESS [12.377s]
[INFO] Apache Sling Scripting Ruby Support ............... SUCCESS [14.267s]
[INFO] Scala Script Engine ............................... SUCCESS [1:39.670s]
[INFO] Apache Sling Scala Scripting Configuration ........ SUCCESS [5.453s]
[INFO] Scala for Sling Demo Application - Hello World .... SUCCESS [3.138s]
[INFO] Scala for Sling Demo Application - Forum .......... SUCCESS [2.711s]
[INFO] Apache Sling Scripting Velocity Support ........... SUCCESS [8.015s]
[INFO] Apache Sling Scripting W3C XML Processing Support . SUCCESS [13.534s]
[INFO] Apache Sling NoSQL Generic Resource Provider ...... SUCCESS [6.368s]
[INFO] Apache Sling NoSQL Couchbase Client ............... SUCCESS [7.838s]
[INFO] Apache Sling NoSQL Couchbase Resource Provider .... SUCCESS [5.122s]
[INFO] Apache Sling NoSQL MongoDB Resource Provider ...... SUCCESS [5.452s]
[INFO] Apache Sling Contrib NoSQL Modules Reactor ........ SUCCESS [3.448s]
[INFO] Apache Sling Launchpad Contrib Testing ............ SUCCESS [2:02.844s]
[INFO] Apache Sling Launchpad Karaf - Features ........... FAILURE [32.150s]
[INFO] Apache Sling Launchpad Karaf - Distribution ....... SKIPPED
[INFO] Apache Sling Launchpad Karaf - Integration Tests .. SKIPPED
[INFO] Apache Sling Launchpad Karaf - Launchpad Oak Tar Integration Tests  SKIPPED
[INFO] Apache Sling Launchpad Karaf Builder .............. SKIPPED
[INFO] Apache Sling Contrib (Builder) .................... SKIPPED
[INFO] ------------------------------------------------------------------------
[INFO] BUILD FAILURE
[INFO] ------------------------------------------------------------------------
[INFO] Total time: 30:49.542s
[INFO] Finished at: Tue Jul 12 10:50:18 UTC 2016
[INFO] Final Memory: 148M/470M
[INFO] ------------------------------------------------------------------------
[JENKINS] Archiving disabled
[JENKINS] Archiving disabled
[JENKINS] Archiving disabled
[JENKINS] Archiving disabled
[JENKINS] Archiving disabled
[JENKINS] Archiving disabled
[JENKINS] Archiving disabled
[JENKINS] Archiving disabled
[JENKINS] Archiving disabled
[JENKINS] Archiving disabled
[JENKINS] Archiving disabled
[JENKINS] Archiving disabled
[JENKINS] Archiving disabled
[JENKINS] Archiving disabled
[JENKINS] Archiving disabled
[JENKINS] Archiving disabled
[JENKINS] Archiving disabled
[JENKINS] Archiving disabled
[JENKINS] Archiving disabled
[JENKINS] Archiving disabled
[JENKINS] Archiving disabled
[JENKINS] Archiving disabled
[JENKINS] Archiving disabled
[JENKINS] Archiving disabled
[JENKINS] Archiving disabled
[JENKINS] Archiving disabled
[JENKINS] Archiving disabled
[JENKINS] Archiving disabled
[JENKINS] Archiving disabled
[JENKINS] Archiving disabled
[JENKINS] Archiving disabled
[JENKINS] Archiving disabled
[JENKINS] Archiving disabled
[JENKINS] Archiving disabled
[JENKINS] Archiving disabled
[JENKINS] Archiving disabled
[JENKINS] Archiving disabled
[JENKINS] Archiving disabled
[JENKINS] Archiving disabled
[JENKINS] Archiving disabled
[JENKINS] Archiving disabled
[JENKINS] Archiving disabled
[JENKINS] Archiving disabled
[JENKINS] Archiving disabled
[JENKINS] Archiving disabled
[JENKINS] Archiving disabled
[JENKINS] Archiving disabled
[JENKINS] Archiving disabled
[JENKINS] Archiving disabled
[JENKINS] Archiving disabled
[JENKINS] Archiving disabled
[JENKINS] Archiving disabled
[JENKINS] Archiving disabled
[JENKINS] Archiving disabled
[JENKINS] Archiving disabled
[JENKINS] Archiving disabled
[JENKINS] Archiving disabled
[JENKINS] Archiving disabled
[JENKINS] Archiving disabled
[JENKINS] Archiving disabled
[JENKINS] Archiving disabled
[JENKINS] Archiving disabled
[JENKINS] Archiving disabled
[JENKINS] Archiving disabled
[JENKINS] Archiving disabled
[JENKINS] Archiving disabled
[JENKINS] Archiving disabled
[JENKINS] Archiving disabled
[JENKINS] Archiving disabled
[JENKINS] Archiving disabled
[JENKINS] Archiving disabled
Waiting for Jenkins to finish collecting data
[ERROR] Failed to execute goal org.apache.karaf.tooling:karaf-maven-plugin:4.0.5:kar (features-create-kar)
on project org.apache.sling.launchpad.karaf-features: Failed to create archive: Could not
find artifact org.apache.sling:org.apache.sling.scripting.freemarker:jar:1.0.0-SNAPSHOT in
Nexus (http://repository.apache.org/snapshots)
[ERROR] 
[ERROR] Try downloading the file manually from the project website.
[ERROR] 
[ERROR] Then, install it using the command:
[ERROR] mvn install:install-file -DgroupId=org.apache.sling -DartifactId=org.apache.sling.scripting.freemarker
-Dversion=1.0.0-SNAPSHOT -Dpackaging=jar -Dfile=/path/to/file
[ERROR] 
[ERROR] Alternatively, if you host your own repository you can deploy the file there:
[ERROR] mvn deploy:deploy-file -DgroupId=org.apache.sling -DartifactId=org.apache.sling.scripting.freemarker
-Dversion=1.0.0-SNAPSHOT -Dpackaging=jar -Dfile=/path/to/file -Durl=[url] -DrepositoryId=[id]
[ERROR] 
[ERROR] 
[ERROR] org.apache.sling:org.apache.sling.scripting.freemarker:jar:1.0.0-SNAPSHOT
[ERROR] 
[ERROR] from the specified remote repositories:
[ERROR] Nexus (http://repository.apache.org/snapshots, releases=false, snapshots=true),
[ERROR] central (http://repo.maven.apache.org/maven2, releases=true, snapshots=false)
[ERROR] -> [Help 1]
[ERROR] 
[ERROR] To see the full stack trace of the errors, re-run Maven with the -e switch.
[ERROR] Re-run Maven using the -X switch to enable full debug logging.
[ERROR] 
[ERROR] For more information about the errors and possible solutions, please read the following
articles:
[ERROR] [Help 1] http://cwiki.apache.org/confluence/display/MAVEN/MojoExecutionException
[ERROR] 
[ERROR] After correcting the problems, you can resume the build with the command
[ERROR]   mvn <goals> -rf :org.apache.sling.launchpad.karaf-features
channel stopped

Mime
View raw message