sling-commits mailing list archives

Site index · List index
Message view « Date » · « Thread »
Top « Date » · « Thread »
From Apache Jenkins Server <jenk...@builds.apache.org>
Subject Build failed in Jenkins: sling-trunk-1.7 #4051
Date Sun, 05 Jun 2016 01:48:31 GMT
See <https://builds.apache.org/job/sling-trunk-1.7/4051/>

------------------------------------------
[...truncated 117563 lines...]
[INFO] Apache Sling Scripting Sightly Models Use Provider  SUCCESS [3.758s]
[INFO] Apache Sling Scripting Sightly Read-Eval-Print Loop Environment  SUCCESS [3.684s]
[INFO] Apache Sling Scripting Sightly Integration Tests Content  SUCCESS [6.458s]
[INFO] Apache Sling Launchpad Base ....................... SUCCESS [20.915s]
[INFO] Apache Sling Subsystems Base Installer ............ SUCCESS [4.729s]
[INFO] Apache Sling RepoInit Parser ...................... SUCCESS [5.590s]
[INFO] Apache Sling RepoInit Oak/JCR module .............. SUCCESS [17.348s]
[INFO] Apache Sling Filesystem Resource Provider ......... SUCCESS [4.105s]
[INFO] Apache Sling Installer WebConsole Plugin .......... SUCCESS [3.987s]
[INFO] Apache Sling Launchpad Application Builder ........ SUCCESS [28.304s]
[INFO] Apache Sling Scripting Sightly Integration Tests .. SUCCESS [2:59.907s]
[INFO] Apache Sling Scripting Sightly Reactor ............ SUCCESS [1.980s]
[INFO] Apache Sling Adapter Manager Implementation ....... SUCCESS [5.114s]
[INFO] Apache Sling Bundle Resource Provider ............. SUCCESS [3.492s]
[INFO] Apache Sling Distributed Event Admin .............. SUCCESS [5.348s]
[INFO] Apache Sling Discovery API ........................ SUCCESS [3.393s]
[INFO] Apache Sling Discovery Commons .................... SUCCESS [50.776s]
[INFO] Apache Sling Discovery Base ....................... SUCCESS [50.648s]
[INFO] Apache Sling Resource-Based Discovery Service ..... SUCCESS [2:54.245s]
[INFO] Apache Sling Oak-Based Discovery Service .......... SUCCESS [2:38.713s]
[INFO] Apache Sling Discovery Support Bundle ............. SUCCESS [3.774s]
[INFO] Apache Sling Discovery Standalone Implementation .. SUCCESS [3.914s]
[INFO] Apache Sling Event Support ........................ SUCCESS [23:18.715s]
[INFO] Apache Sling Feature Flags ........................ SUCCESS [4.388s]
[INFO] Apache Sling javax.activation bundle .............. SUCCESS [3.874s]
[INFO] Apache Sling Service User Mapper .................. SUCCESS [5.448s]
[INFO] Apache Sling Settings ............................. SUCCESS [6.693s]
[INFO] Apache Sling Web Console Branding ................. SUCCESS [3.901s]
[INFO] Apache Sling Web Console Security Provider ........ SUCCESS [4.764s]
[INFO] Apache Sling Explorer ............................. SUCCESS [3.909s]
[INFO] Apache Sling Health Check Core .................... SUCCESS [2:29.491s]
[INFO] Apache Sling Health Check Samples ................. SUCCESS [5.790s]
[INFO] Apache Sling Health Check Support Components ...... SUCCESS [7.533s]
[INFO] Apache Sling Health Check Webconsole Plugin ....... SUCCESS [3.836s]
[INFO] Apache Sling Health Check JUnit Bridge ............ SUCCESS [5.188s]
[INFO] Apache Sling Health Check Annotations ............. SUCCESS [2.765s]
[INFO] Apache Sling Health Check Integration Tests ....... SUCCESS [8.178s]
[INFO] Apache Sling Health Check Reactor POM ............. SUCCESS [2.511s]
[INFO] Apache Sling Resource Access Security ............. SUCCESS [3.849s]
[INFO] Apache Sling Resource Access Security Integration Tests  SUCCESS [30.598s]
[INFO] Apache Sling Models API ........................... SUCCESS [3.996s]
[INFO] Apache Sling Models Implementation ................ SUCCESS [9.981s]
[INFO] Apache Sling Models Integration Tests ............. SUCCESS [37.537s]
[INFO] Apache Sling Internationalization Support ......... SUCCESS [56.150s]
[INFO] Apache Sling XSS Protection Bundle ................ FAILURE [12.434s]
[INFO] Apache Sling JUnit Core ........................... SKIPPED
[INFO] Apache Sling JUnit Tests Teleporter ............... SKIPPED
[INFO] Apache Sling Resource Builder ..................... SKIPPED
[INFO] Apache Sling Servlet Helpers ...................... SKIPPED
[INFO] Apache Sling RepoInit Integration Tests ........... SKIPPED
[INFO] Apache Sling RepoInit Reactor ..................... SKIPPED
[INFO] Apache Sling Test Tools ........................... SKIPPED
[INFO] Apache Sling Testing Clients ...................... SKIPPED
[INFO] Apache Sling Testing Hamcrest ..................... SKIPPED
[INFO] Apache Sling Server Setup Tools ................... SKIPPED
[INFO] Apache Sling Testing Rules ........................ SKIPPED
[INFO] Apache Sling JUnit Scriptable Tests Provider ...... SKIPPED
[INFO] Apache Sling JUnit Health Checks .................. SKIPPED
[INFO] Apache Sling JUnit Remote Tests Runners ........... SKIPPED
[INFO] Apache Sling JUnit Performance .................... SKIPPED
[INFO] Apache Sling Testing Mock Log Configuration ....... SKIPPED
[INFO] Apache Sling Testing Resource Resolver Mock ....... SKIPPED
[INFO] Apache Sling Testing JCR Mock ..................... SKIPPED
[INFO] Apache Sling Testing OSGi Mock .................... SKIPPED
[INFO] Apache Sling Testing Sling Mock ................... SKIPPED
[INFO] Apache Sling Testing Sling Mock Oak-based Resource Resolver  SKIPPED
[INFO] Apache Sling Testing Mocks Modules Reactor ........ SKIPPED
[INFO] Apache Sling Testing - sample bundle with integration tests  SKIPPED
[INFO] Apache Sling Testing - sample module with integration tests  SKIPPED
[INFO] Apache Sling Testing Modules Reactor .............. SKIPPED
[INFO] Apache Sling Installer ............................ SKIPPED
[INFO] Apache Sling File Installer ....................... SKIPPED
[INFO] Apache Sling JCR Installer ........................ SKIPPED
[INFO] Apache Sling Installer Configuration Admin Support  SKIPPED
[INFO] Apache Sling Deployment Package Installer ......... SKIPPED
[INFO] Apache Sling Subsystems Installer ................. SKIPPED
[INFO] Apache Sling Installer Integration Tests .......... SKIPPED
[INFO] Apache Sling Launchpad API ........................ SKIPPED
[INFO] Apache Sling Launchpad Installer .................. SKIPPED
[INFO] Apache Sling Launchpad Content .................... SKIPPED
[INFO] Apache Sling Launchpad Testing Services ........... SKIPPED
[INFO] Apache Sling Launchpad Testing Services WAR ....... SKIPPED
[INFO] Apache Sling Launchpad Testing Fragment Bundle .... SKIPPED
[INFO] Apache Sling Launchpad Test Bundles ............... SKIPPED
[INFO] Apache Sling Integration Tests .................... SKIPPED
[INFO] Apache Sling Launchpad Testing .................... SKIPPED
[INFO] Apache Sling (Builder) ............................ SKIPPED
[INFO] ------------------------------------------------------------------------
[INFO] BUILD FAILURE
[INFO] ------------------------------------------------------------------------
[INFO] Total time: 54:59.497s
[INFO] Finished at: Sun Jun 05 01:47:11 UTC 2016
[INFO] Final Memory: 199M/471M
[INFO] ------------------------------------------------------------------------
[JENKINS] Archiving disabled
[JENKINS] Archiving disabled
[JENKINS] Archiving disabled
[JENKINS] Archiving disabled
[JENKINS] Archiving disabled
[JENKINS] Archiving disabled
[JENKINS] Archiving disabled
[JENKINS] Archiving disabled
[JENKINS] Archiving disabled
[JENKINS] Archiving disabled
[JENKINS] Archiving disabled
[JENKINS] Archiving disabled
[JENKINS] Archiving disabled
[JENKINS] Archiving disabled
[JENKINS] Archiving disabled
[JENKINS] Archiving disabled
[JENKINS] Archiving disabled
[JENKINS] Archiving disabled
[JENKINS] Archiving disabled
[JENKINS] Archiving disabled
[JENKINS] Archiving disabled
[JENKINS] Archiving disabled
[JENKINS] Archiving disabled
[JENKINS] Archiving disabled
[JENKINS] Archiving disabled
[JENKINS] Archiving disabled
[JENKINS] Archiving disabled
[JENKINS] Archiving disabled
[JENKINS] Archiving disabled
[JENKINS] Archiving disabled
[JENKINS] Archiving disabled
[JENKINS] Archiving disabled
[JENKINS] Archiving disabled
[JENKINS] Archiving disabled
[JENKINS] Archiving disabled
[JENKINS] Archiving disabled
[JENKINS] Archiving disabled
[JENKINS] Archiving disabled
[JENKINS] Archiving disabled
[JENKINS] Archiving disabled
[JENKINS] Archiving disabled
[JENKINS] Archiving disabled
[JENKINS] Archiving disabled
[JENKINS] Archiving disabled
[JENKINS] Archiving disabled
[JENKINS] Archiving disabled
[JENKINS] Archiving disabled
[JENKINS] Archiving disabled
[JENKINS] Archiving disabled
[JENKINS] Archiving disabled
[JENKINS] Archiving disabled
[JENKINS] Archiving disabled
[JENKINS] Archiving disabled
[JENKINS] Archiving disabled
[JENKINS] Archiving disabled
[JENKINS] Archiving disabled
[JENKINS] Archiving disabled
[JENKINS] Archiving disabled
[JENKINS] Archiving disabled
[JENKINS] Archiving disabled
[JENKINS] Archiving disabled
[JENKINS] Archiving disabled
[JENKINS] Archiving disabled
[JENKINS] Archiving disabled
[JENKINS] Archiving disabled
[JENKINS] Archiving disabled
[JENKINS] Archiving disabled
[JENKINS] Archiving disabled
[JENKINS] Archiving disabled
[JENKINS] Archiving disabled
[JENKINS] Archiving disabled
[JENKINS] Archiving disabled
[JENKINS] Archiving disabled
[JENKINS] Archiving disabled
[JENKINS] Archiving disabled
[JENKINS] Archiving disabled
[JENKINS] Archiving disabled
[JENKINS] Archiving disabled
[JENKINS] Archiving disabled
[JENKINS] Archiving disabled
[JENKINS] Archiving disabled
[JENKINS] Archiving disabled
[JENKINS] Archiving disabled
[JENKINS] Archiving disabled
[JENKINS] Archiving disabled
[JENKINS] Archiving disabled
[JENKINS] Archiving disabled
[JENKINS] Archiving disabled
[JENKINS] Archiving disabled
[JENKINS] Archiving disabled
[JENKINS] Archiving disabled
[JENKINS] Archiving disabled
[JENKINS] Archiving disabled
[JENKINS] Archiving disabled
[JENKINS] Archiving disabled
[JENKINS] Archiving disabled
[JENKINS] Archiving disabled
[JENKINS] Archiving disabled
[JENKINS] Archiving disabled
[JENKINS] Archiving disabled
[JENKINS] Archiving disabled
[JENKINS] Archiving disabled
[JENKINS] Archiving disabled
[JENKINS] Archiving disabled
[JENKINS] Archiving disabled
[JENKINS] Archiving disabled
[JENKINS] Archiving disabled
[JENKINS] Archiving disabled
[JENKINS] Archiving disabled
[JENKINS] Archiving disabled
[JENKINS] Archiving disabled
[JENKINS] Archiving disabled
[JENKINS] Archiving disabled
[JENKINS] Archiving disabled
[JENKINS] Archiving disabled
[JENKINS] Archiving disabled
[JENKINS] Archiving disabled
[JENKINS] Archiving disabled
[JENKINS] Archiving disabled
[JENKINS] Archiving disabled
[JENKINS] Archiving disabled
[JENKINS] Archiving disabled
[JENKINS] Archiving disabled
[JENKINS] Archiving disabled
[JENKINS] Archiving disabled
[JENKINS] Archiving disabled
[JENKINS] Archiving disabled
[JENKINS] Archiving disabled
[JENKINS] Archiving disabled
[JENKINS] Archiving disabled
[JENKINS] Archiving disabled
[JENKINS] Archiving disabled
[JENKINS] Archiving disabled
[JENKINS] Archiving disabled
[JENKINS] Archiving disabled
[JENKINS] Archiving disabled
[JENKINS] Archiving disabled
[JENKINS] Archiving disabled
[JENKINS] Archiving disabled
[JENKINS] Archiving disabled
[JENKINS] Archiving disabled
[JENKINS] Archiving disabled
[JENKINS] Archiving disabled
Waiting for Jenkins to finish collecting data
[ERROR] Failed to execute goal org.apache.felix:maven-bundle-plugin:3.0.1:baseline (baseline)
on project org.apache.sling.xss: Baseline failed, see generated report -> [Help 1]
[ERROR] 
[ERROR] To see the full stack trace of the errors, re-run Maven with the -e switch.
[ERROR] Re-run Maven using the -X switch to enable full debug logging.
[ERROR] 
[ERROR] For more information about the errors and possible solutions, please read the following
articles:
[ERROR] [Help 1] http://cwiki.apache.org/confluence/display/MAVEN/MojoFailureException
[ERROR] 
[ERROR] After correcting the problems, you can resume the build with the command
[ERROR]   mvn <goals> -rf :org.apache.sling.xss
channel stopped

Mime
View raw message