sling-commits mailing list archives

Site index · List index
Message view « Date » · « Thread »
Top « Date » · « Thread »
From Apache Jenkins Server <jenk...@builds.apache.org>
Subject Build failed in Jenkins: sling-contrib-1.7 #953
Date Fri, 17 Jun 2016 08:49:03 GMT
See <https://builds.apache.org/job/sling-contrib-1.7/953/>

------------------------------------------
[...truncated 4626 lines...]
Downloading: http://repo.maven.apache.org/maven2/org/apache/sling/org.apache.sling.auth.xing.oauth/0.0.2/org.apache.sling.auth.xing.oauth-0.0.2.jar
Downloaded: http://repo.maven.apache.org/maven2/org/apache/sling/org.apache.sling.auth.xing.oauth/0.0.2/org.apache.sling.auth.xing.oauth-0.0.2.jar
(308 KB at 1594.3 KB/sec)
[INFO] Baseline Report - Generated by Apache Felix Maven Bundle Plugin on 2016-06-17T08:30Z
based on Bnd - see http://www.aqute.biz/Bnd/Bnd
[INFO] Comparing bundle org.apache.sling.auth.xing.oauth version 0.0.3-SNAPSHOT to version
0.0.2
[INFO] 
[INFO]   PACKAGE_NAME                                       DELTA      CUR_VER    BASE_VER
  REC_VER    WARNINGS  
[INFO] = ================================================== ========== ========== ==========
========== ==========
[INFO]   org.apache.sling.auth.xing.oauth                   unchanged  0.0.2      0.0.2  
   0.0.2      -         
[INFO] -----------------------------------------------------------------------------------------------------------
[INFO] Baseline analysis complete, 0 error(s), 0 warning(s)
[INFO] 
[INFO] --- maven-install-plugin:2.5.2:install (default-install) @ org.apache.sling.auth.xing.oauth
---
[INFO] Installing <https://builds.apache.org/job/sling-contrib-1.7/ws/trunk/auth/org.apache.sling.auth.xing.oauth/target/org.apache.sling.auth.xing.oauth-0.0.3-SNAPSHOT.jar>
to /home/jenkins/jenkins-slave/maven-repositories/0/org/apache/sling/org.apache.sling.auth.xing.oauth/0.0.3-SNAPSHOT/org.apache.sling.auth.xing.oauth-0.0.3-SNAPSHOT.jar
[INFO] Installing <https://builds.apache.org/job/sling-contrib-1.7/ws/trunk/auth/org.apache.sling.auth.xing.oauth/pom.xml>
to /home/jenkins/jenkins-slave/maven-repositories/0/org/apache/sling/org.apache.sling.auth.xing.oauth/0.0.3-SNAPSHOT/org.apache.sling.auth.xing.oauth-0.0.3-SNAPSHOT.pom
[INFO] Installing <https://builds.apache.org/job/sling-contrib-1.7/ws/trunk/auth/org.apache.sling.auth.xing.oauth/target/org.apache.sling.auth.xing.oauth-0.0.3-SNAPSHOT-sources.jar>
to /home/jenkins/jenkins-slave/maven-repositories/0/org/apache/sling/org.apache.sling.auth.xing.oauth/0.0.3-SNAPSHOT/org.apache.sling.auth.xing.oauth-0.0.3-SNAPSHOT-sources.jar
[INFO] 
[INFO] --- maven-bundle-plugin:3.0.1:install (default-install) @ org.apache.sling.auth.xing.oauth
---
[INFO] Local OBR update disabled (enable with -DobrRepository)
[JENKINS] Archiving disabled
[INFO]                                                                         
[INFO] ------------------------------------------------------------------------
[INFO] Building Apache Sling Authentication Selector 1.0.7-SNAPSHOT
[INFO] ------------------------------------------------------------------------
Downloading: http://repo.maven.apache.org/maven2/org/apache/sling/org.apache.sling.api/2.1.0/org.apache.sling.api-2.1.0.pom
Downloaded: http://repo.maven.apache.org/maven2/org/apache/sling/org.apache.sling.api/2.1.0/org.apache.sling.api-2.1.0.pom
(6 KB at 71.1 KB/sec)
Downloading: http://repo.maven.apache.org/maven2/org/apache/sling/org.apache.sling.auth.core/1.1.0/org.apache.sling.auth.core-1.1.0.pom
Downloaded: http://repo.maven.apache.org/maven2/org/apache/sling/org.apache.sling.auth.core/1.1.0/org.apache.sling.auth.core-1.1.0.pom
(7 KB at 798.3 KB/sec)
Downloading: http://repo.maven.apache.org/maven2/org/apache/sling/org.apache.sling.auth.form/1.0.0/org.apache.sling.auth.form-1.0.0.pom
Downloaded: http://repo.maven.apache.org/maven2/org/apache/sling/org.apache.sling.auth.form/1.0.0/org.apache.sling.auth.form-1.0.0.pom
(7 KB at 69.1 KB/sec)
Downloading: http://repo.maven.apache.org/maven2/org/apache/sling/org.apache.sling.auth.openid/1.0.0/org.apache.sling.auth.openid-1.0.0.pom
Downloaded: http://repo.maven.apache.org/maven2/org/apache/sling/org.apache.sling.auth.openid/1.0.0/org.apache.sling.auth.openid-1.0.0.pom
(7 KB at 777.1 KB/sec)
Downloading: http://repo.maven.apache.org/maven2/com/dyuproject/dyuproject-openid/1.1.7/dyuproject-openid-1.1.7.pom
Downloading: http://dyuproject.googlecode.com/svn/repos/maven2/com/dyuproject/dyuproject-openid/1.1.7/dyuproject-openid-1.1.7.pom
[WARNING] The POM for com.dyuproject:dyuproject-openid:jar:1.1.7 is missing, no dependency
information available
Downloading: http://repo.maven.apache.org/maven2/com/dyuproject/dyuproject-util/1.1.7/dyuproject-util-1.1.7.pom
Downloading: http://dyuproject.googlecode.com/svn/repos/maven2/com/dyuproject/dyuproject-util/1.1.7/dyuproject-util-1.1.7.pom
[WARNING] The POM for com.dyuproject:dyuproject-util:jar:1.1.7 is missing, no dependency information
available
Downloading: http://repo.maven.apache.org/maven2/com/dyuproject/dyuproject-json/1.1.7/dyuproject-json-1.1.7.pom
Downloading: http://dyuproject.googlecode.com/svn/repos/maven2/com/dyuproject/dyuproject-json/1.1.7/dyuproject-json-1.1.7.pom
[WARNING] The POM for com.dyuproject:dyuproject-json:jar:1.1.7 is missing, no dependency information
available
Downloading: http://repo.maven.apache.org/maven2/org/mortbay/jetty/jetty-util/6.1.19/jetty-util-6.1.19.pom
Downloaded: http://repo.maven.apache.org/maven2/org/mortbay/jetty/jetty-util/6.1.19/jetty-util-6.1.19.pom
(4 KB at 44.0 KB/sec)
Downloading: http://repo.maven.apache.org/maven2/org/mortbay/jetty/project/6.1.19/project-6.1.19.pom
Downloaded: http://repo.maven.apache.org/maven2/org/mortbay/jetty/project/6.1.19/project-6.1.19.pom
(9 KB at 107.2 KB/sec)
Downloading: http://repo.maven.apache.org/maven2/org/mortbay/jetty/jetty-parent/8/jetty-parent-8.pom
Downloaded: http://repo.maven.apache.org/maven2/org/mortbay/jetty/jetty-parent/8/jetty-parent-8.pom
(3 KB at 342.5 KB/sec)
Downloading: http://repo.maven.apache.org/maven2/org/eclipse/jetty/jetty-parent/9/jetty-parent-9.pom
Downloaded: http://repo.maven.apache.org/maven2/org/eclipse/jetty/jetty-parent/9/jetty-parent-9.pom
(15 KB at 2115.0 KB/sec)
Downloading: http://repo.maven.apache.org/maven2/org/apache/sling/org.apache.sling.commons.osgi/2.0.2-incubator/org.apache.sling.commons.osgi-2.0.2-incubator.pom
Downloaded: http://repo.maven.apache.org/maven2/org/apache/sling/org.apache.sling.commons.osgi/2.0.2-incubator/org.apache.sling.commons.osgi-2.0.2-incubator.pom
(4 KB at 29.9 KB/sec)
Downloading: http://repo.maven.apache.org/maven2/org/apache/sling/sling/3-incubator/sling-3-incubator.pom
Downloaded: http://repo.maven.apache.org/maven2/org/apache/sling/sling/3-incubator/sling-3-incubator.pom
(26 KB at 2796.1 KB/sec)
Downloading: http://repo.maven.apache.org/maven2/org/apache/sling/org.apache.sling.api/2.0.2-incubator/org.apache.sling.api-2.0.2-incubator.pom
Downloaded: http://repo.maven.apache.org/maven2/org/apache/sling/org.apache.sling.api/2.0.2-incubator/org.apache.sling.api-2.0.2-incubator.pom
(4 KB at 537.7 KB/sec)
Downloading: http://repo.maven.apache.org/maven2/commons-lang/commons-lang/2.0/commons-lang-2.0.pom
Downloaded: http://repo.maven.apache.org/maven2/commons-lang/commons-lang/2.0/commons-lang-2.0.pom
(3 KB at 370.4 KB/sec)
Downloading: http://repo.maven.apache.org/maven2/org/apache/sling/org.apache.sling.api/2.1.0/org.apache.sling.api-2.1.0.jar
Downloading: http://repo.maven.apache.org/maven2/org/apache/sling/org.apache.sling.auth.core/1.1.0/org.apache.sling.auth.core-1.1.0.jar
Downloading: http://repo.maven.apache.org/maven2/org/apache/sling/org.apache.sling.auth.openid/1.0.0/org.apache.sling.auth.openid-1.0.0.jar
Downloading: http://repo.maven.apache.org/maven2/org/apache/sling/org.apache.sling.auth.form/1.0.0/org.apache.sling.auth.form-1.0.0.jar
Downloading: http://repo.maven.apache.org/maven2/com/dyuproject/dyuproject-openid/1.1.7/dyuproject-openid-1.1.7.jar
Downloaded: http://repo.maven.apache.org/maven2/org/apache/sling/org.apache.sling.api/2.1.0/org.apache.sling.api-2.1.0.jar
(65 KB at 5863.6 KB/sec)
Downloading: http://repo.maven.apache.org/maven2/com/dyuproject/dyuproject-util/1.1.7/dyuproject-util-1.1.7.jar
Downloading: http://repo.maven.apache.org/maven2/com/dyuproject/dyuproject-json/1.1.7/dyuproject-json-1.1.7.jar
Downloading: http://repo.maven.apache.org/maven2/org/mortbay/jetty/jetty-util/6.1.19/jetty-util-6.1.19.jar
Downloaded: http://repo.maven.apache.org/maven2/org/apache/sling/org.apache.sling.auth.form/1.0.0/org.apache.sling.auth.form-1.0.0.jar
(64 KB at 1088.3 KB/sec)
Downloading: http://repo.maven.apache.org/maven2/org/apache/sling/org.apache.sling.commons.osgi/2.0.2-incubator/org.apache.sling.commons.osgi-2.0.2-incubator.jar
Downloading: http://repo.maven.apache.org/maven2/commons-lang/commons-lang/2.0/commons-lang-2.0.jar
Downloaded: http://repo.maven.apache.org/maven2/org/apache/sling/org.apache.sling.commons.osgi/2.0.2-incubator/org.apache.sling.commons.osgi-2.0.2-incubator.jar
(16 KB at 774.1 KB/sec)
Downloaded: http://repo.maven.apache.org/maven2/org/mortbay/jetty/jetty-util/6.1.19/jetty-util-6.1.19.jar
(170 KB at 3685.9 KB/sec)
Downloaded: http://repo.maven.apache.org/maven2/commons-lang/commons-lang/2.0/commons-lang-2.0.jar
(166 KB at 3527.3 KB/sec)
Downloaded: http://repo.maven.apache.org/maven2/org/apache/sling/org.apache.sling.auth.openid/1.0.0/org.apache.sling.auth.openid-1.0.0.jar
(299 KB at 1193.6 KB/sec)
Downloaded: http://repo.maven.apache.org/maven2/org/apache/sling/org.apache.sling.auth.core/1.1.0/org.apache.sling.auth.core-1.1.0.jar
(82 KB at 236.0 KB/sec)
Downloading: http://dyuproject.googlecode.com/svn/repos/maven2/com/dyuproject/dyuproject-openid/1.1.7/dyuproject-openid-1.1.7.jar
Downloading: http://dyuproject.googlecode.com/svn/repos/maven2/com/dyuproject/dyuproject-util/1.1.7/dyuproject-util-1.1.7.jar
Downloading: http://dyuproject.googlecode.com/svn/repos/maven2/com/dyuproject/dyuproject-json/1.1.7/dyuproject-json-1.1.7.jar
[JENKINS] Archiving disabled
[INFO] ------------------------------------------------------------------------
[INFO] Reactor Summary:
[INFO] 
[INFO] Apache Sling Authentication XING API .............. SUCCESS [43.363s]
[INFO] Apache Sling Authentication XING Login ............ SUCCESS [24.867s]
[INFO] Apache Sling Authentication XING OAuth ............ SUCCESS [30.130s]
[INFO] Apache Sling Authentication Selector .............. FAILURE [3.584s]
[INFO] Apache Sling Commons HTML Utilities ............... SKIPPED
[INFO] Apache Sling APT parser ........................... SKIPPED
[INFO] Apache Sling APT servlet .......................... SKIPPED
[INFO] Apache Sling Resource Collection API .............. SKIPPED
[INFO] Apache Sling DataSource Provider .................. SKIPPED
[INFO] Apache Sling Dojo JavaScript Library .............. SKIPPED
[INFO] Apache Sling Dojo Data Extension .................. SKIPPED
[INFO] Apache Sling FTP Server ........................... SKIPPED
[INFO] Apache Sling Google Web Toolkit Servlet Library ... SKIPPED
[INFO] Apache Sling Google Web Toolkit Sample ............ SKIPPED
[INFO] Apache Sling JMX Resource Provider ................ SKIPPED
[INFO] Apache Sling ClassLoader Leak Detector ............ SKIPPED
[INFO] Apache Sling MongoDB Resource Provider ............ SKIPPED
[INFO] Apache Sling OSGi Bundle Repository ............... SKIPPED
[INFO] Apache Sling Distribution API ..................... SKIPPED
[INFO] Apache Sling Distribution Core .................... SKIPPED
[INFO] Apache Sling Distribution Extensions .............. SKIPPED
[INFO] Apache Sling Distribution Sample .................. SKIPPED
[INFO] Apache Sling Distribution Integration Tests ....... SKIPPED
[INFO] Apache Sling Log Tail Implementation .............. SKIPPED
[INFO] S3 dependencies for Oak ........................... SKIPPED
[INFO] Apache Sling Request Processing Analyzer .......... SKIPPED
[INFO] Apache Sling Resource Merger ...................... SKIPPED
[INFO] Apache Sling Inventory Printer Based on Resources . SKIPPED
[INFO] Apache Sling Rewriter ............................. SKIPPED
[INFO] Apache Sling Security ............................. SKIPPED
[INFO] Apache Sling SLF4J MDC Filter ..................... SKIPPED
[INFO] Apache Sling Query ................................ SKIPPED
[INFO] Apache Sling Superimposing Resource Provider ...... SKIPPED
[INFO] Apache Sling Tenant ............................... SKIPPED
[INFO] Apache Sling Log Tracer ........................... SKIPPED
[INFO] Apache Sling URL Rewriter ......................... SKIPPED
[INFO] HApi - Sling Hypermedia API tools ................. SKIPPED
[INFO] HApi - Sling Hypermedia API client-side tools ..... SKIPPED
[INFO] HApi - Sample Content ............................. SKIPPED
[INFO] HApi - Sling Hypermedia API Tools Reactor ......... SKIPPED
[INFO] Apache Sling Dynamic Include ...................... SKIPPED
[INFO] Apache Sling JCR Java Compiler .................... SKIPPED
[INFO] Apache Sling Repository Accessor .................. SKIPPED
[INFO] Apache Sling Object Content Mapping ............... SKIPPED
[INFO] Apache Sling JCR Prefs ............................ SKIPPED
[INFO] Apache Sling JCR Resource Security ................ SKIPPED
[INFO] Apache Sling Script Console ....................... SKIPPED
[INFO] Apache Sling Atom Tag Library ..................... SKIPPED
[INFO] Apache Sling Scripting FreeMarker ................. SKIPPED
[INFO] Apache Sling Scripting Groovy Support ............. SKIPPED
[INFO] Apache Sling Scripting Java Support ............... SKIPPED
[INFO] Apache Sling Scripting JST Support ................ SKIPPED
[INFO] Apache Sling Scripting Python Support ............. SKIPPED
[INFO] Apache Sling Scripting Ruby Support ............... SKIPPED
[INFO] Scala Script Engine ............................... SKIPPED
[INFO] Apache Sling Scala Scripting Configuration ........ SKIPPED
[INFO] Scala for Sling Demo Application - Hello World .... SKIPPED
[INFO] Scala for Sling Demo Application - Forum .......... SKIPPED
[INFO] Apache Sling Launchpad Karaf - Features ........... SKIPPED
[INFO] Apache Sling Launchpad Karaf - Integration Tests .. SKIPPED
[INFO] Apache Sling Scripting FreeMarker IT .............. SKIPPED
[INFO] Apache Sling Scripting Thymeleaf .................. SKIPPED
[INFO] Apache Sling Scripting Thymeleaf IT ............... SKIPPED
[INFO] Apache Sling Scripting Velocity Support ........... SKIPPED
[INFO] Apache Sling Scripting W3C XML Processing Support . SKIPPED
[INFO] Apache Sling NoSQL Generic Resource Provider ...... SKIPPED
[INFO] Apache Sling NoSQL Couchbase Client ............... SKIPPED
[INFO] Apache Sling NoSQL Couchbase Resource Provider .... SKIPPED
[INFO] Apache Sling NoSQL MongoDB Resource Provider ...... SKIPPED
[INFO] Apache Sling Contrib NoSQL Modules Reactor ........ SKIPPED
[INFO] Apache Sling Launchpad Contrib Testing ............ SKIPPED
[INFO] Apache Sling Launchpad Karaf - Distribution ....... SKIPPED
[INFO] Apache Sling Launchpad Karaf - Launchpad Oak Tar Integration Tests  SKIPPED
[INFO] Apache Sling Launchpad Karaf Builder .............. SKIPPED
[INFO] Apache Sling Contrib (Builder) .................... SKIPPED
[INFO] ------------------------------------------------------------------------
[INFO] BUILD FAILURE
[INFO] ------------------------------------------------------------------------
[INFO] Total time: 3:04.135s
[INFO] Finished at: Fri Jun 17 08:31:50 UTC 2016
[INFO] Final Memory: 51M/263M
[INFO] ------------------------------------------------------------------------
[JENKINS] Archiving disabled
[JENKINS] Archiving disabled
[JENKINS] Archiving disabled
[JENKINS] Archiving disabled
[JENKINS] Archiving disabled
[JENKINS] Archiving disabled
[JENKINS] Archiving disabled
[JENKINS] Archiving disabled
[JENKINS] Archiving disabled
[JENKINS] Archiving disabled
[JENKINS] Archiving disabled
[JENKINS] Archiving disabled
[JENKINS] Archiving disabled
[JENKINS] Archiving disabled
[JENKINS] Archiving disabled
[JENKINS] Archiving disabled
[JENKINS] Archiving disabled
[JENKINS] Archiving disabled
[JENKINS] Archiving disabled
[JENKINS] Archiving disabled
[JENKINS] Archiving disabled
[JENKINS] Archiving disabled
[JENKINS] Archiving disabled
[JENKINS] Archiving disabled
[JENKINS] Archiving disabled
[JENKINS] Archiving disabled
[JENKINS] Archiving disabled
[JENKINS] Archiving disabled
[JENKINS] Archiving disabled
[JENKINS] Archiving disabled
[JENKINS] Archiving disabled
[JENKINS] Archiving disabled
[JENKINS] Archiving disabled
[JENKINS] Archiving disabled
[JENKINS] Archiving disabled
[JENKINS] Archiving disabled
[JENKINS] Archiving disabled
[JENKINS] Archiving disabled
[JENKINS] Archiving disabled
[JENKINS] Archiving disabled
[JENKINS] Archiving disabled
[JENKINS] Archiving disabled
[JENKINS] Archiving disabled
[JENKINS] Archiving disabled
[JENKINS] Archiving disabled
[JENKINS] Archiving disabled
[JENKINS] Archiving disabled
[JENKINS] Archiving disabled
[JENKINS] Archiving disabled
[JENKINS] Archiving disabled
[JENKINS] Archiving disabled
[JENKINS] Archiving disabled
[JENKINS] Archiving disabled
[JENKINS] Archiving disabled
[JENKINS] Archiving disabled
[JENKINS] Archiving disabled
[JENKINS] Archiving disabled
[JENKINS] Archiving disabled
[JENKINS] Archiving disabled
[JENKINS] Archiving disabled
[JENKINS] Archiving disabled
[JENKINS] Archiving disabled
[JENKINS] Archiving disabled
[JENKINS] Archiving disabled
[JENKINS] Archiving disabled
[JENKINS] Archiving disabled
[JENKINS] Archiving disabled
[JENKINS] Archiving disabled
[JENKINS] Archiving disabled
[JENKINS] Archiving disabled
[JENKINS] Archiving disabled
[JENKINS] Archiving disabled
[JENKINS] Archiving disabled
[JENKINS] Archiving disabled
[JENKINS] Archiving disabled
Waiting for Jenkins to finish collecting data
[ERROR] Failed to execute goal on project org.apache.sling.auth.selector: Could not resolve
dependencies for project org.apache.sling:org.apache.sling.auth.selector:bundle:1.0.7-SNAPSHOT:
The following artifacts could not be resolved: com.dyuproject:dyuproject-openid:jar:1.1.7,
com.dyuproject:dyuproject-util:jar:1.1.7, com.dyuproject:dyuproject-json:jar:1.1.7: Could
not find artifact com.dyuproject:dyuproject-openid:jar:1.1.7 in central (http://repo.maven.apache.org/maven2)
-> [Help 1]
[ERROR] 
[ERROR] To see the full stack trace of the errors, re-run Maven with the -e switch.
[ERROR] Re-run Maven using the -X switch to enable full debug logging.
[ERROR] 
[ERROR] For more information about the errors and possible solutions, please read the following
articles:
[ERROR] [Help 1] http://cwiki.apache.org/confluence/display/MAVEN/DependencyResolutionException
[ERROR] 
[ERROR] After correcting the problems, you can resume the build with the command
[ERROR]   mvn <goals> -rf :org.apache.sling.auth.selector
channel stopped

Mime
View raw message