sling-commits mailing list archives

Site index · List index
Message view « Date » · « Thread »
Top « Date » · « Thread »
From Apache Jenkins Server <jenk...@builds.apache.org>
Subject Build failed in Jenkins: sling-contrib-1.7 #923
Date Mon, 16 May 2016 09:27:09 GMT
See <https://builds.apache.org/job/sling-contrib-1.7/923/changes>

Changes:

[olli] rename NonCachingTemplateResolver to SlingResourceTemplateResolver (still non-caching,
but the default one)

------------------------------------------
[...truncated 3368 lines...]
[INFO]   org.apache.sling.distribution                      unchanged  0.3.0      0.3.0  
   0.3.0      -         
[INFO] -----------------------------------------------------------------------------------------------------------
[INFO]   org.apache.sling.distribution.event                unchanged  0.1.1      0.1.1  
   0.1.1      -         
[INFO] -----------------------------------------------------------------------------------------------------------
[INFO]   org.apache.sling.distribution.transport            unchanged  0.1.0      0.1.0  
   0.1.0      -         
[INFO] -----------------------------------------------------------------------------------------------------------
[INFO] Baseline analysis complete, 0 error(s), 0 warning(s)
[INFO] 
[INFO] --- maven-install-plugin:2.5.2:install (default-install) @ org.apache.sling.distribution.api
---
[INFO] Installing <https://builds.apache.org/job/sling-contrib-1.7/ws/trunk/extensions/distribution/api/target/org.apache.sling.distribution.api-0.3.1-SNAPSHOT.jar>
to /home/jenkins/jenkins-slave/maven-repositories/1/org/apache/sling/org.apache.sling.distribution.api/0.3.1-SNAPSHOT/org.apache.sling.distribution.api-0.3.1-SNAPSHOT.jar
[INFO] Installing <https://builds.apache.org/job/sling-contrib-1.7/ws/trunk/extensions/distribution/api/pom.xml>
to /home/jenkins/jenkins-slave/maven-repositories/1/org/apache/sling/org.apache.sling.distribution.api/0.3.1-SNAPSHOT/org.apache.sling.distribution.api-0.3.1-SNAPSHOT.pom
[INFO] Installing <https://builds.apache.org/job/sling-contrib-1.7/ws/trunk/extensions/distribution/api/target/org.apache.sling.distribution.api-0.3.1-SNAPSHOT-sources.jar>
to /home/jenkins/jenkins-slave/maven-repositories/1/org/apache/sling/org.apache.sling.distribution.api/0.3.1-SNAPSHOT/org.apache.sling.distribution.api-0.3.1-SNAPSHOT-sources.jar
[INFO] 
[INFO] --- maven-bundle-plugin:3.0.1:install (default-install) @ org.apache.sling.distribution.api
---
[INFO] Local OBR update disabled (enable with -DobrRepository)
[JENKINS] Archiving disabled
[INFO]                                                                         
[INFO] ------------------------------------------------------------------------
[INFO] Building Apache Sling Distribution Core 0.1.19-SNAPSHOT
[INFO] ------------------------------------------------------------------------
[INFO] 
[INFO] --- maven-clean-plugin:2.5:clean (default-clean) @ org.apache.sling.distribution.core
---
[INFO] 
[INFO] --- maven-enforcer-plugin:1.3.1:enforce (enforce-java) @ org.apache.sling.distribution.core
---
[INFO] 
[INFO] --- maven-antrun-plugin:1.8:run (set-bundle-required-execution-environment) @ org.apache.sling.distribution.core
---
[INFO] Executing tasks

main:
[INFO] Executed tasks
[INFO] 
[INFO] --- maven-remote-resources-plugin:1.5:process (default) @ org.apache.sling.distribution.core
---
[INFO] 
[INFO] --- maven-resources-plugin:2.7:resources (default-resources) @ org.apache.sling.distribution.core
---
[INFO] Using 'UTF-8' encoding to copy filtered resources.
[INFO] skip non existing resourceDirectory <https://builds.apache.org/job/sling-contrib-1.7/ws/trunk/extensions/distribution/core/src/main/resources>
[INFO] Copying 3 resources
[INFO] 
[INFO] --- maven-antrun-plugin:1.8:run (check-memory-task) @ org.apache.sling.distribution.core
---
[INFO] Executing tasks

main:
     [echo] **************** WARNING (SLING-443/SLING-1782) ******************************
     [echo] On most platforms, you'll get OutOfMemoryErrors when building unless you set
     [echo] on 32bit platforms: MAVEN_OPTS="-Xmx256M -XX:MaxPermSize=256M", see SLING-443
     [echo] on 64bit platforms: MAVEN_OPTS="-Xmx512M -XX:MaxPermSize=512M", see SLING-1782
     [echo] ******************************************************************************
[INFO] Executed tasks
[INFO] 
[INFO] --- maven-compiler-plugin:3.2:compile (default-compile) @ org.apache.sling.distribution.core
---
[INFO] Changes detected - recompiling the module!
[INFO] Compiling 142 source files to <https://builds.apache.org/job/sling-contrib-1.7/ws/trunk/extensions/distribution/core/target/classes>
[INFO] <https://builds.apache.org/job/sling-contrib-1.7/ws/trunk/extensions/distribution/core/src/main/java/org/apache/sling/distribution/resources/impl/common/AbstractReadableResourceProvider.java>:
Some input files use or override a deprecated API.
[INFO] <https://builds.apache.org/job/sling-contrib-1.7/ws/trunk/extensions/distribution/core/src/main/java/org/apache/sling/distribution/resources/impl/common/AbstractReadableResourceProvider.java>:
Recompile with -Xlint:deprecation for details.
[INFO] <https://builds.apache.org/job/sling-contrib-1.7/ws/trunk/extensions/distribution/core/src/main/java/org/apache/sling/distribution/resources/impl/common/AbstractReadableResourceProvider.java>:
Some input files use unchecked or unsafe operations.
[INFO] <https://builds.apache.org/job/sling-contrib-1.7/ws/trunk/extensions/distribution/core/src/main/java/org/apache/sling/distribution/resources/impl/common/AbstractReadableResourceProvider.java>:
Recompile with -Xlint:unchecked for details.
[INFO] -------------------------------------------------------------
[ERROR] COMPILATION ERROR : 
[INFO] -------------------------------------------------------------
[ERROR] <https://builds.apache.org/job/sling-contrib-1.7/ws/trunk/extensions/distribution/core/src/main/java/org/apache/sling/distribution/agent/impl/ForwardDistributionAgentFactory.java>:[47,61]
cannot find symbol
  symbol:   class AsyncTransportDistributionPackageExporter
  location: package org.apache.sling.distribution.packaging.impl.exporter
[ERROR] <https://builds.apache.org/job/sling-contrib-1.7/ws/trunk/extensions/distribution/core/src/main/java/org/apache/sling/distribution/agent/impl/ForwardDistributionAgentFactory.java>:[258,35]
cannot find symbol
  symbol:   class AsyncTransportDistributionPackageExporter
  location: class org.apache.sling.distribution.agent.impl.ForwardDistributionAgentFactory
[INFO] 2 errors 
[INFO] -------------------------------------------------------------
[JENKINS] Archiving disabled
[INFO] ------------------------------------------------------------------------
[INFO] Reactor Summary:
[INFO] 
[INFO] Apache Sling OpenID Authentication ................ SUCCESS [30.554s]
[INFO] Apache Sling Authentication XING API .............. SUCCESS [5.592s]
[INFO] Apache Sling Authentication XING Login ............ SUCCESS [7.288s]
[INFO] Apache Sling Authentication XING OAuth ............ SUCCESS [7.222s]
[INFO] Apache Sling Authentication Selector .............. SUCCESS [3.459s]
[INFO] Apache Sling Commons HTML Utilities ............... SUCCESS [37.205s]
[INFO] Apache Sling APT parser ........................... SUCCESS [6.439s]
[INFO] Apache Sling APT servlet .......................... SUCCESS [4.849s]
[INFO] Apache Sling Resource Collection API .............. SUCCESS [4.229s]
[INFO] Apache Sling DataSource Provider .................. SUCCESS [12.899s]
[INFO] Apache Sling Dojo JavaScript Library .............. SUCCESS [20.636s]
[INFO] Apache Sling Dojo Data Extension .................. SUCCESS [3.885s]
[INFO] Apache Sling FTP Server ........................... SUCCESS [4.726s]
[INFO] Apache Sling Google Web Toolkit Servlet Library ... SUCCESS [5.508s]
[INFO] Apache Sling Google Web Toolkit Sample ............ SUCCESS [1:11.555s]
[INFO] Apache Sling JMX Resource Provider ................ SUCCESS [3.289s]
[INFO] Apache Sling ClassLoader Leak Detector ............ SUCCESS [5.662s]
[INFO] Apache Sling MongoDB Resource Provider ............ SUCCESS [4.311s]
[INFO] Apache Sling OSGi Bundle Repository ............... SUCCESS [6.520s]
[INFO] Apache Sling Distribution API ..................... SUCCESS [56.518s]
[INFO] Apache Sling Distribution Core .................... FAILURE [2.856s]
[INFO] Apache Sling Distribution Extensions .............. SKIPPED
[INFO] Apache Sling Distribution Sample .................. SKIPPED
[INFO] Apache Sling Distribution Integration Tests ....... SKIPPED
[INFO] Apache Sling Log Tail Implementation .............. SKIPPED
[INFO] S3 dependencies for Oak ........................... SKIPPED
[INFO] Apache Sling Request Processing Analyzer .......... SKIPPED
[INFO] Apache Sling Resource Merger ...................... SKIPPED
[INFO] Apache Sling Inventory Printer Based on Resources . SKIPPED
[INFO] Apache Sling Rewriter ............................. SKIPPED
[INFO] Apache Sling Security ............................. SKIPPED
[INFO] Apache Sling SLF4J MDC Filter ..................... SKIPPED
[INFO] Apache Sling Query ................................ SKIPPED
[INFO] Apache Sling Superimposing Resource Provider ...... SKIPPED
[INFO] Apache Sling Tenant ............................... SKIPPED
[INFO] Apache Sling Log Tracer ........................... SKIPPED
[INFO] Apache Sling URL Rewriter ......................... SKIPPED
[INFO] HApi - Sling Hypermedia API tools ................. SKIPPED
[INFO] HApi - Sling Hypermedia API client-side tools ..... SKIPPED
[INFO] HApi - Sample Content ............................. SKIPPED
[INFO] HApi - Sling Hypermedia API Tools Reactor ......... SKIPPED
[INFO] Apache Sling Dynamic Include ...................... SKIPPED
[INFO] Apache Sling JCR Java Compiler .................... SKIPPED
[INFO] Apache Sling Repository Accessor .................. SKIPPED
[INFO] Apache Sling Object Content Mapping ............... SKIPPED
[INFO] Apache Sling JCR Prefs ............................ SKIPPED
[INFO] Apache Sling JCR Resource Security ................ SKIPPED
[INFO] Apache Sling Script Console ....................... SKIPPED
[INFO] Apache Sling Atom Tag Library ..................... SKIPPED
[INFO] Apache Sling Scripting FreeMarker ................. SKIPPED
[INFO] Apache Sling Scripting Groovy Support ............. SKIPPED
[INFO] Apache Sling Scripting Java Support ............... SKIPPED
[INFO] Apache Sling Scripting JST Support ................ SKIPPED
[INFO] Apache Sling Scripting Python Support ............. SKIPPED
[INFO] Apache Sling Scripting Ruby Support ............... SKIPPED
[INFO] Scala Script Engine ............................... SKIPPED
[INFO] Apache Sling Scala Scripting Configuration ........ SKIPPED
[INFO] Scala for Sling Demo Application - Hello World .... SKIPPED
[INFO] Scala for Sling Demo Application - Forum .......... SKIPPED
[INFO] Apache Sling Launchpad Karaf - Features ........... SKIPPED
[INFO] Apache Sling Launchpad Karaf - Integration Tests .. SKIPPED
[INFO] Apache Sling Scripting FreeMarker IT .............. SKIPPED
[INFO] Apache Sling Scripting Thymeleaf .................. SKIPPED
[INFO] Apache Sling Scripting Thymeleaf IT ............... SKIPPED
[INFO] Apache Sling Scripting Velocity Support ........... SKIPPED
[INFO] Apache Sling Scripting W3C XML Processing Support . SKIPPED
[INFO] Apache Sling NoSQL Generic Resource Provider ...... SKIPPED
[INFO] Apache Sling NoSQL Couchbase Client ............... SKIPPED
[INFO] Apache Sling NoSQL Couchbase Resource Provider .... SKIPPED
[INFO] Apache Sling NoSQL MongoDB Resource Provider ...... SKIPPED
[INFO] Apache Sling Contrib NoSQL Modules Reactor ........ SKIPPED
[INFO] Apache Sling Launchpad Contrib Testing ............ SKIPPED
[INFO] Apache Sling Launchpad Karaf - Distribution ....... SKIPPED
[INFO] Apache Sling Launchpad Karaf - Launchpad Oak Tar Integration Tests  SKIPPED
[INFO] Apache Sling Launchpad Karaf Builder .............. SKIPPED
[INFO] Apache Sling Contrib (Builder) .................... SKIPPED
[INFO] ------------------------------------------------------------------------
[INFO] BUILD FAILURE
[INFO] ------------------------------------------------------------------------
[INFO] Total time: 5:27.318s
[INFO] Finished at: Mon May 16 09:25:10 UTC 2016
[INFO] Final Memory: 85M/487M
[INFO] ------------------------------------------------------------------------
[JENKINS] Archiving disabled
[JENKINS] Archiving disabled
[JENKINS] Archiving disabled
[JENKINS] Archiving disabled
[JENKINS] Archiving disabled
[JENKINS] Archiving disabled
[JENKINS] Archiving disabled
[JENKINS] Archiving disabled
[JENKINS] Archiving disabled
[JENKINS] Archiving disabled
[JENKINS] Archiving disabled
[JENKINS] Archiving disabled
[JENKINS] Archiving disabled
[JENKINS] Archiving disabled
[JENKINS] Archiving disabled
[JENKINS] Archiving disabled
[JENKINS] Archiving disabled
[JENKINS] Archiving disabled
[JENKINS] Archiving disabled
[JENKINS] Archiving disabled
[JENKINS] Archiving disabled
[JENKINS] Archiving disabled
[JENKINS] Archiving disabled
[JENKINS] Archiving disabled
[JENKINS] Archiving disabled
[JENKINS] Archiving disabled
[JENKINS] Archiving disabled
[JENKINS] Archiving disabled
[JENKINS] Archiving disabled
[JENKINS] Archiving disabled
[JENKINS] Archiving disabled
[JENKINS] Archiving disabled
[JENKINS] Archiving disabled
[JENKINS] Archiving disabled
[JENKINS] Archiving disabled
[JENKINS] Archiving disabled
[JENKINS] Archiving disabled
[JENKINS] Archiving disabled
[JENKINS] Archiving disabled
[JENKINS] Archiving disabled
[JENKINS] Archiving disabled
[JENKINS] Archiving disabled
[JENKINS] Archiving disabled
[JENKINS] Archiving disabled
[JENKINS] Archiving disabled
[JENKINS] Archiving disabled
[JENKINS] Archiving disabled
[JENKINS] Archiving disabled
[JENKINS] Archiving disabled
[JENKINS] Archiving disabled
[JENKINS] Archiving disabled
[JENKINS] Archiving disabled
[JENKINS] Archiving disabled
[JENKINS] Archiving disabled
[JENKINS] Archiving disabled
[JENKINS] Archiving disabled
[JENKINS] Archiving disabled
[JENKINS] Archiving disabled
[JENKINS] Archiving disabled
[JENKINS] Archiving disabled
[JENKINS] Archiving disabled
[JENKINS] Archiving disabled
[JENKINS] Archiving disabled
[JENKINS] Archiving disabled
[JENKINS] Archiving disabled
[JENKINS] Archiving disabled
[JENKINS] Archiving disabled
[JENKINS] Archiving disabled
[JENKINS] Archiving disabled
[JENKINS] Archiving disabled
[JENKINS] Archiving disabled
[JENKINS] Archiving disabled
[JENKINS] Archiving disabled
[JENKINS] Archiving disabled
[JENKINS] Archiving disabled
[JENKINS] Archiving disabled
Waiting for Jenkins to finish collecting data
[ERROR] Failed to execute goal org.apache.maven.plugins:maven-compiler-plugin:3.2:compile
(default-compile) on project org.apache.sling.distribution.core: Compilation failure: Compilation
failure:
[ERROR] <https://builds.apache.org/job/sling-contrib-1.7/ws/trunk/extensions/distribution/core/src/main/java/org/apache/sling/distribution/agent/impl/ForwardDistributionAgentFactory.java>:[47,61]
cannot find symbol
[ERROR] symbol:   class AsyncTransportDistributionPackageExporter
[ERROR] location: package org.apache.sling.distribution.packaging.impl.exporter
[ERROR] <https://builds.apache.org/job/sling-contrib-1.7/ws/trunk/extensions/distribution/core/src/main/java/org/apache/sling/distribution/agent/impl/ForwardDistributionAgentFactory.java>:[258,35]
cannot find symbol
[ERROR] symbol:   class AsyncTransportDistributionPackageExporter
[ERROR] location: class org.apache.sling.distribution.agent.impl.ForwardDistributionAgentFactory
[ERROR] -> [Help 1]
[ERROR] 
[ERROR] To see the full stack trace of the errors, re-run Maven with the -e switch.
[ERROR] Re-run Maven using the -X switch to enable full debug logging.
[ERROR] 
[ERROR] For more information about the errors and possible solutions, please read the following
articles:
[ERROR] [Help 1] http://cwiki.apache.org/confluence/display/MAVEN/MojoFailureException
[ERROR] 
[ERROR] After correcting the problems, you can resume the build with the command
[ERROR]   mvn <goals> -rf :org.apache.sling.distribution.core
channel stopped

Mime
View raw message