sling-commits mailing list archives

Site index · List index
Message view « Date » · « Thread »
Top « Date » · « Thread »
From Apache Jenkins Server <jenk...@builds.apache.org>
Subject Build failed in Jenkins: sling-contrib-1.7 #916
Date Tue, 10 May 2016 16:45:31 GMT
See <https://builds.apache.org/job/sling-contrib-1.7/916/changes>

Changes:

[tommaso] SLING-5717 - added unit test for PrivilegeDistributionRequestAuthorizationStrategy

------------------------------------------
[...truncated 7041 lines...]
Downloading: http://repo.maven.apache.org/maven2/org/apache/httpcomponents/httpcore-nio/4.3.2/httpcore-nio-4.3.2.jar
Downloaded: http://repo.maven.apache.org/maven2/org/apache/sling/org.apache.sling.event.dea/1.0.0/org.apache.sling.event.dea-1.0.0.jar
(27 KB at 725.2 KB/sec)
Downloading: http://repo.maven.apache.org/maven2/org/apache/httpcomponents/httpcore-osgi/4.3.2/httpcore-osgi-4.3.2.jar
Downloaded: http://repo.maven.apache.org/maven2/org/apache/httpcomponents/httpcore-nio/4.3.2/httpcore-nio-4.3.2.jar
(310 KB at 9091.3 KB/sec)
Downloading: http://repo.maven.apache.org/maven2/org/apache/httpcomponents/httpclient-osgi/4.3.4/httpclient-osgi-4.3.4.jar
Downloaded: http://repo.maven.apache.org/maven2/org/apache/jackrabbit/jackrabbit-spi-commons/2.6.4/jackrabbit-spi-commons-2.6.4.jar
(767 KB at 7982.9 KB/sec)
Downloading: http://repo.maven.apache.org/maven2/org/apache/httpcomponents/httpmime/4.3.4/httpmime-4.3.4.jar
Downloaded: http://repo.maven.apache.org/maven2/org/apache/httpcomponents/httpcore-osgi/4.3.2/httpcore-osgi-4.3.2.jar
(590 KB at 9830.1 KB/sec)
Downloading: http://repo.maven.apache.org/maven2/org/apache/httpcomponents/httpclient-cache/4.3.4/httpclient-cache-4.3.4.jar
Downloaded: http://repo.maven.apache.org/maven2/org/apache/jackrabbit/vault/org.apache.jackrabbit.vault/3.1.24/org.apache.jackrabbit.vault-3.1.24.jar
(1292 KB at 12413.6 KB/sec)
Downloading: http://repo.maven.apache.org/maven2/org/apache/httpcomponents/fluent-hc/4.3.4/fluent-hc-4.3.4.jar
Downloaded: http://repo.maven.apache.org/maven2/org/apache/httpcomponents/httpclient-osgi/4.3.4/httpclient-osgi-4.3.4.jar
(1307 KB at 20095.3 KB/sec)
Downloading: http://repo.maven.apache.org/maven2/org/apache/jackrabbit/jackrabbit-jcr-commons/2.6.2/jackrabbit-jcr-commons-2.6.2.jar
Downloaded: http://repo.maven.apache.org/maven2/org/apache/httpcomponents/httpclient-cache/4.3.4/httpclient-cache-4.3.4.jar
(147 KB at 5850.3 KB/sec)
Downloading: http://repo.maven.apache.org/maven2/org/apache/jackrabbit/jackrabbit-api/2.6.2/jackrabbit-api-2.6.2.jar
Downloaded: http://repo.maven.apache.org/maven2/org/apache/httpcomponents/fluent-hc/4.3.4/fluent-hc-4.3.4.jar
(30 KB at 1464.1 KB/sec)
Downloaded: http://repo.maven.apache.org/maven2/org/apache/httpcomponents/httpmime/4.3.4/httpmime-4.3.4.jar
(37 KB at 1070.7 KB/sec)
Downloaded: http://repo.maven.apache.org/maven2/org/apache/jackrabbit/jackrabbit-api/2.6.2/jackrabbit-api-2.6.2.jar
(37 KB at 1337.2 KB/sec)
Downloaded: http://repo.maven.apache.org/maven2/org/apache/sling/org.apache.sling.jcr.resource/2.3.12/org.apache.sling.jcr.resource-2.3.12.jar
(125 KB at 775.7 KB/sec)
Downloaded: http://repo.maven.apache.org/maven2/org/apache/jackrabbit/jackrabbit-jcr-commons/2.6.2/jackrabbit-jcr-commons-2.6.2.jar
(345 KB at 7828.3 KB/sec)
[INFO] 
[INFO] --- maven-clean-plugin:2.5:clean (default-clean) @ org.apache.sling.distribution.core
---
[INFO] 
[INFO] --- maven-enforcer-plugin:1.3.1:enforce (enforce-java) @ org.apache.sling.distribution.core
---
[INFO] 
[INFO] --- maven-antrun-plugin:1.8:run (set-bundle-required-execution-environment) @ org.apache.sling.distribution.core
---
[INFO] Executing tasks

main:
[INFO] Executed tasks
[INFO] 
[INFO] --- maven-remote-resources-plugin:1.5:process (default) @ org.apache.sling.distribution.core
---
[INFO] 
[INFO] --- maven-resources-plugin:2.7:resources (default-resources) @ org.apache.sling.distribution.core
---
[INFO] Using 'UTF-8' encoding to copy filtered resources.
[INFO] skip non existing resourceDirectory <https://builds.apache.org/job/sling-contrib-1.7/ws/trunk/extensions/distribution/core/src/main/resources>
[INFO] Copying 3 resources
[INFO] 
[INFO] --- maven-antrun-plugin:1.8:run (check-memory-task) @ org.apache.sling.distribution.core
---
[INFO] Executing tasks

main:
     [echo] **************** WARNING (SLING-443/SLING-1782) ******************************
     [echo] On most platforms, you'll get OutOfMemoryErrors when building unless you set
     [echo] on 32bit platforms: MAVEN_OPTS="-Xmx256M -XX:MaxPermSize=256M", see SLING-443
     [echo] on 64bit platforms: MAVEN_OPTS="-Xmx512M -XX:MaxPermSize=512M", see SLING-1782
     [echo] ******************************************************************************
[INFO] Executed tasks
[INFO] 
[INFO] --- maven-compiler-plugin:3.2:compile (default-compile) @ org.apache.sling.distribution.core
---
[INFO] Changes detected - recompiling the module!
[INFO] Compiling 142 source files to <https://builds.apache.org/job/sling-contrib-1.7/ws/trunk/extensions/distribution/core/target/classes>
[INFO] <https://builds.apache.org/job/sling-contrib-1.7/ws/trunk/extensions/distribution/core/src/main/java/org/apache/sling/distribution/resources/impl/common/AbstractReadableResourceProvider.java>:
Some input files use or override a deprecated API.
[INFO] <https://builds.apache.org/job/sling-contrib-1.7/ws/trunk/extensions/distribution/core/src/main/java/org/apache/sling/distribution/resources/impl/common/AbstractReadableResourceProvider.java>:
Recompile with -Xlint:deprecation for details.
[INFO] <https://builds.apache.org/job/sling-contrib-1.7/ws/trunk/extensions/distribution/core/src/main/java/org/apache/sling/distribution/resources/impl/common/AbstractReadableResourceProvider.java>:
Some input files use unchecked or unsafe operations.
[INFO] <https://builds.apache.org/job/sling-contrib-1.7/ws/trunk/extensions/distribution/core/src/main/java/org/apache/sling/distribution/resources/impl/common/AbstractReadableResourceProvider.java>:
Recompile with -Xlint:unchecked for details.
[INFO] -------------------------------------------------------------
[ERROR] COMPILATION ERROR : 
[INFO] -------------------------------------------------------------
[ERROR] <https://builds.apache.org/job/sling-contrib-1.7/ws/trunk/extensions/distribution/core/src/main/java/org/apache/sling/distribution/agent/impl/ForwardDistributionAgentFactory.java>:[47,61]
cannot find symbol
  symbol:   class AsyncTransportDistributionPackageExporter
  location: package org.apache.sling.distribution.packaging.impl.exporter
[ERROR] <https://builds.apache.org/job/sling-contrib-1.7/ws/trunk/extensions/distribution/core/src/main/java/org/apache/sling/distribution/agent/impl/ForwardDistributionAgentFactory.java>:[258,35]
cannot find symbol
  symbol:   class AsyncTransportDistributionPackageExporter
  location: class org.apache.sling.distribution.agent.impl.ForwardDistributionAgentFactory
[INFO] 2 errors 
[INFO] -------------------------------------------------------------
[JENKINS] Archiving disabled
[INFO] ------------------------------------------------------------------------
[INFO] Reactor Summary:
[INFO] 
[INFO] Apache Sling OpenID Authentication ................ SUCCESS [46.187s]
[INFO] Apache Sling Authentication XING API .............. SUCCESS [5.991s]
[INFO] Apache Sling Authentication XING Login ............ SUCCESS [9.568s]
[INFO] Apache Sling Authentication XING OAuth ............ SUCCESS [10.444s]
[INFO] Apache Sling Authentication Selector .............. SUCCESS [9.587s]
[INFO] Apache Sling Commons HTML Utilities ............... SUCCESS [7.461s]
[INFO] Apache Sling APT parser ........................... SUCCESS [7.281s]
[INFO] Apache Sling APT servlet .......................... SUCCESS [5.009s]
[INFO] Apache Sling Resource Collection API .............. SUCCESS [9.324s]
[INFO] Apache Sling DataSource Provider .................. SUCCESS [11.223s]
[INFO] Apache Sling Dojo JavaScript Library .............. SUCCESS [15.081s]
[INFO] Apache Sling Dojo Data Extension .................. SUCCESS [9.156s]
[INFO] Apache Sling FTP Server ........................... SUCCESS [8.067s]
[INFO] Apache Sling Google Web Toolkit Servlet Library ... SUCCESS [8.145s]
[INFO] Apache Sling Google Web Toolkit Sample ............ SUCCESS [40.303s]
[INFO] Apache Sling JMX Resource Provider ................ SUCCESS [3.688s]
[INFO] Apache Sling ClassLoader Leak Detector ............ SUCCESS [6.412s]
[INFO] Apache Sling MongoDB Resource Provider ............ SUCCESS [8.831s]
[INFO] Apache Sling OSGi Bundle Repository ............... SUCCESS [8.144s]
[INFO] Apache Sling Distribution API ..................... SUCCESS [4.619s]
[INFO] Apache Sling Distribution Core .................... FAILURE [3.385s]
[INFO] Apache Sling Distribution Extensions .............. SKIPPED
[INFO] Apache Sling Distribution Sample .................. SKIPPED
[INFO] Apache Sling Distribution Integration Tests ....... SKIPPED
[INFO] Apache Sling Log Tail Implementation .............. SKIPPED
[INFO] S3 dependencies for Oak ........................... SKIPPED
[INFO] Apache Sling Request Processing Analyzer .......... SKIPPED
[INFO] Apache Sling Resource Merger ...................... SKIPPED
[INFO] Apache Sling Inventory Printer Based on Resources . SKIPPED
[INFO] Apache Sling Rewriter ............................. SKIPPED
[INFO] Apache Sling Security ............................. SKIPPED
[INFO] Apache Sling SLF4J MDC Filter ..................... SKIPPED
[INFO] Apache Sling Query ................................ SKIPPED
[INFO] Apache Sling Superimposing Resource Provider ...... SKIPPED
[INFO] Apache Sling Tenant ............................... SKIPPED
[INFO] Apache Sling Log Tracer ........................... SKIPPED
[INFO] Apache Sling URL Rewriter ......................... SKIPPED
[INFO] HApi - Sling Hypermedia API tools ................. SKIPPED
[INFO] HApi - Sling Hypermedia API client-side tools ..... SKIPPED
[INFO] HApi - Sample Content ............................. SKIPPED
[INFO] HApi - Sling Hypermedia API Tools Reactor ......... SKIPPED
[INFO] Apache Sling Dynamic Include ...................... SKIPPED
[INFO] Apache Sling JCR Java Compiler .................... SKIPPED
[INFO] Apache Sling Repository Accessor .................. SKIPPED
[INFO] Apache Sling Object Content Mapping ............... SKIPPED
[INFO] Apache Sling JCR Prefs ............................ SKIPPED
[INFO] Apache Sling JCR Resource Security ................ SKIPPED
[INFO] Apache Sling Script Console ....................... SKIPPED
[INFO] Apache Sling Atom Tag Library ..................... SKIPPED
[INFO] Apache Sling Scripting FreeMarker ................. SKIPPED
[INFO] Apache Sling Scripting Groovy Support ............. SKIPPED
[INFO] Apache Sling Scripting Java Support ............... SKIPPED
[INFO] Apache Sling Scripting JST Support ................ SKIPPED
[INFO] Apache Sling Scripting Python Support ............. SKIPPED
[INFO] Apache Sling Scripting Ruby Support ............... SKIPPED
[INFO] Scala Script Engine ............................... SKIPPED
[INFO] Apache Sling Scala Scripting Configuration ........ SKIPPED
[INFO] Scala for Sling Demo Application - Hello World .... SKIPPED
[INFO] Scala for Sling Demo Application - Forum .......... SKIPPED
[INFO] Apache Sling Launchpad Karaf - Features ........... SKIPPED
[INFO] Apache Sling Launchpad Karaf - Integration Tests .. SKIPPED
[INFO] Apache Sling Scripting FreeMarker IT .............. SKIPPED
[INFO] Apache Sling Scripting Thymeleaf .................. SKIPPED
[INFO] Apache Sling Scripting Thymeleaf IT ............... SKIPPED
[INFO] Apache Sling Scripting Velocity Support ........... SKIPPED
[INFO] Apache Sling Scripting W3C XML Processing Support . SKIPPED
[INFO] Apache Sling NoSQL Generic Resource Provider ...... SKIPPED
[INFO] Apache Sling NoSQL Couchbase Client ............... SKIPPED
[INFO] Apache Sling NoSQL Couchbase Resource Provider .... SKIPPED
[INFO] Apache Sling NoSQL MongoDB Resource Provider ...... SKIPPED
[INFO] Apache Sling Contrib NoSQL Modules Reactor ........ SKIPPED
[INFO] Apache Sling Launchpad Contrib Testing ............ SKIPPED
[INFO] Apache Sling Launchpad Karaf - Distribution ....... SKIPPED
[INFO] Apache Sling Launchpad Karaf - Launchpad Oak Tar Integration Tests  SKIPPED
[INFO] Apache Sling Launchpad Karaf Builder .............. SKIPPED
[INFO] Apache Sling Contrib (Builder) .................... SKIPPED
[INFO] ------------------------------------------------------------------------
[INFO] BUILD FAILURE
[INFO] ------------------------------------------------------------------------
[INFO] Total time: 4:28.886s
[INFO] Finished at: Tue May 10 16:44:59 UTC 2016
[INFO] Final Memory: 79M/237M
[INFO] ------------------------------------------------------------------------
[JENKINS] Archiving disabled
[JENKINS] Archiving disabled
[JENKINS] Archiving disabled
[JENKINS] Archiving disabled
[JENKINS] Archiving disabled
[JENKINS] Archiving disabled
[JENKINS] Archiving disabled
[JENKINS] Archiving disabled
[JENKINS] Archiving disabled
[JENKINS] Archiving disabled
[JENKINS] Archiving disabled
[JENKINS] Archiving disabled
[JENKINS] Archiving disabled
[JENKINS] Archiving disabled
[JENKINS] Archiving disabled
[JENKINS] Archiving disabled
[JENKINS] Archiving disabled
[JENKINS] Archiving disabled
[JENKINS] Archiving disabled
[JENKINS] Archiving disabled
[JENKINS] Archiving disabled
[JENKINS] Archiving disabled
[JENKINS] Archiving disabled
[JENKINS] Archiving disabled
[JENKINS] Archiving disabled
[JENKINS] Archiving disabled
[JENKINS] Archiving disabled
[JENKINS] Archiving disabled
[JENKINS] Archiving disabled
[JENKINS] Archiving disabled
[JENKINS] Archiving disabled
[JENKINS] Archiving disabled
[JENKINS] Archiving disabled
[JENKINS] Archiving disabled
[JENKINS] Archiving disabled
[JENKINS] Archiving disabled
[JENKINS] Archiving disabled
[JENKINS] Archiving disabled
[JENKINS] Archiving disabled
[JENKINS] Archiving disabled
[JENKINS] Archiving disabled
[JENKINS] Archiving disabled
[JENKINS] Archiving disabled
[JENKINS] Archiving disabled
[JENKINS] Archiving disabled
[JENKINS] Archiving disabled
[JENKINS] Archiving disabled
[JENKINS] Archiving disabled
[JENKINS] Archiving disabled
[JENKINS] Archiving disabled
[JENKINS] Archiving disabled
[JENKINS] Archiving disabled
[JENKINS] Archiving disabled
[JENKINS] Archiving disabled
[JENKINS] Archiving disabled
[JENKINS] Archiving disabled
[JENKINS] Archiving disabled
[JENKINS] Archiving disabled
[JENKINS] Archiving disabled
[JENKINS] Archiving disabled
[JENKINS] Archiving disabled
[JENKINS] Archiving disabled
[JENKINS] Archiving disabled
[JENKINS] Archiving disabled
[JENKINS] Archiving disabled
[JENKINS] Archiving disabled
[JENKINS] Archiving disabled
[JENKINS] Archiving disabled
[JENKINS] Archiving disabled
[JENKINS] Archiving disabled
[JENKINS] Archiving disabled
[JENKINS] Archiving disabled
[JENKINS] Archiving disabled
[JENKINS] Archiving disabled
[JENKINS] Archiving disabled
[JENKINS] Archiving disabled
Waiting for Jenkins to finish collecting data
[ERROR] Failed to execute goal org.apache.maven.plugins:maven-compiler-plugin:3.2:compile
(default-compile) on project org.apache.sling.distribution.core: Compilation failure: Compilation
failure:
[ERROR] <https://builds.apache.org/job/sling-contrib-1.7/ws/trunk/extensions/distribution/core/src/main/java/org/apache/sling/distribution/agent/impl/ForwardDistributionAgentFactory.java>:[47,61]
cannot find symbol
[ERROR] symbol:   class AsyncTransportDistributionPackageExporter
[ERROR] location: package org.apache.sling.distribution.packaging.impl.exporter
[ERROR] <https://builds.apache.org/job/sling-contrib-1.7/ws/trunk/extensions/distribution/core/src/main/java/org/apache/sling/distribution/agent/impl/ForwardDistributionAgentFactory.java>:[258,35]
cannot find symbol
[ERROR] symbol:   class AsyncTransportDistributionPackageExporter
[ERROR] location: class org.apache.sling.distribution.agent.impl.ForwardDistributionAgentFactory
[ERROR] -> [Help 1]
[ERROR] 
[ERROR] To see the full stack trace of the errors, re-run Maven with the -e switch.
[ERROR] Re-run Maven using the -X switch to enable full debug logging.
[ERROR] 
[ERROR] For more information about the errors and possible solutions, please read the following
articles:
[ERROR] [Help 1] http://cwiki.apache.org/confluence/display/MAVEN/MojoFailureException
[ERROR] 
[ERROR] After correcting the problems, you can resume the build with the command
[ERROR]   mvn <goals> -rf :org.apache.sling.distribution.core
channel stopped

Mime
View raw message