sling-commits mailing list archives

Site index · List index
Message view « Date » · « Thread »
Top « Date » · « Thread »
From Apache Jenkins Server <jenk...@builds.apache.org>
Subject Build failed in Jenkins: sling-trunk-1.8 #3028
Date Tue, 19 Apr 2016 02:27:27 GMT
See <https://builds.apache.org/job/sling-trunk-1.8/3028/>

------------------------------------------
[...truncated 591065 lines...]
[INFO] Apache Sling Versioning Integration Tests ......... SUCCESS [16.501s]
[INFO] Apache Sling JCR Repository Registration .......... SUCCESS [12.185s]
[INFO] Apache Sling DavEx Access to repositories ......... SUCCESS [17.669s]
[INFO] Apache Sling JCR WebConsole Bundle ................ SUCCESS [9.492s]
[INFO] Apache Sling SlingRepository Integration Tests .... SUCCESS [34.197s]
[INFO] Apache Sling Servlet Resolver ..................... SUCCESS [18.705s]
[INFO] Apache Sling Default GET Servlets ................. SUCCESS [8.041s]
[INFO] Apache Sling Default POST Servlets ................ SUCCESS [17.409s]
[INFO] Apache Sling Compat Servlets ...................... SUCCESS [14.820s]
[INFO] Apache Sling Scripting Implementation API ......... SUCCESS [10.850s]
[INFO] Apache Sling Scripting Core implementation ........ SUCCESS [26.052s]
[INFO] Apache Sling Scripting JavaScript Support ......... SUCCESS [30.664s]
[INFO] Apache Sling Scripting JSP Support ................ SUCCESS [21.096s]
[INFO] Apache Sling JSP Tag Library ...................... SUCCESS [17.640s]
[INFO] Apache Sling JSP Standard Tag Library ............. SUCCESS [16.241s]
[INFO] Apache Sling Scripting Sightly Engine ............. SUCCESS [43.457s]
[INFO] Apache Sling Scripting Sightly JavaScript Use Provider  SUCCESS [18.327s]
[INFO] Apache Sling Scripting Sightly Models Use Provider  SUCCESS [7.658s]
[INFO] Apache Sling Scripting Sightly Read-Eval-Print Loop Environment  SUCCESS [6.987s]
[INFO] Apache Sling Scripting Sightly Integration Tests Content  SUCCESS [12.846s]
[INFO] Apache Sling Launchpad Application Builder ........ SUCCESS [22.806s]
[INFO] Apache Sling Scripting Sightly Integration Tests .. SUCCESS [3:24.833s]
[INFO] Apache Sling Scripting Sightly Reactor ............ SUCCESS [2.447s]
[INFO] Apache Sling Adapter Manager Implementation ....... SUCCESS [9.111s]
[INFO] Apache Sling Bundle Resource Provider ............. SUCCESS [5.110s]
[INFO] Apache Sling Distributed Event Admin .............. SUCCESS [12.118s]
[INFO] Apache Sling Discovery API ........................ SUCCESS [12.950s]
[INFO] Apache Sling Discovery Commons .................... SUCCESS [2:45.303s]
[INFO] Apache Sling Discovery Base ....................... SUCCESS [1:24.730s]
[INFO] Apache Sling Resource-Based Discovery Service ..... SUCCESS [28:34.117s]
[INFO] Apache Sling Oak-Based Discovery Service .......... SUCCESS [12:35.389s]
[INFO] Apache Sling Discovery Support Bundle ............. SUCCESS [9.284s]
[INFO] Apache Sling Discovery Standalone Implementation .. SUCCESS [11.121s]
[INFO] Apache Sling Event Support ........................ SUCCESS [17:00.637s]
[INFO] Apache Sling Feature Flags ........................ SUCCESS [5.738s]
[INFO] Apache Sling javax.activation bundle .............. SUCCESS [11.342s]
[INFO] Apache Sling Service User Mapper .................. SUCCESS [8.171s]
[INFO] Apache Sling Settings ............................. SUCCESS [10.711s]
[INFO] Apache Sling Web Console Branding ................. SUCCESS [6.138s]
[INFO] Apache Sling Web Console Security Provider ........ SUCCESS [6.634s]
[INFO] Apache Sling Explorer ............................. SUCCESS [5.496s]
[INFO] Apache Sling Health Check Core .................... SUCCESS [1:44.161s]
[INFO] Apache Sling Health Check Samples ................. SUCCESS [23.357s]
[INFO] Apache Sling Health Check Support Components ...... SUCCESS [6.514s]
[INFO] Apache Sling Health Check Webconsole Plugin ....... SUCCESS [6.875s]
[INFO] Apache Sling Health Check JUnit Bridge ............ SUCCESS [8.183s]
[INFO] Apache Sling Health Check Annotations ............. SUCCESS [3.552s]
[INFO] Apache Sling Health Check Integration Tests ....... SUCCESS [10.332s]
[INFO] Apache Sling Health Check Reactor POM ............. SUCCESS [3.477s]
[INFO] Apache Sling Resource Access Security ............. SUCCESS [11.132s]
[INFO] Apache Sling Resource Access Security Integration Tests  SUCCESS [45.372s]
[INFO] Apache Sling Models API ........................... SUCCESS [6.496s]
[INFO] Apache Sling Models Implementation ................ SUCCESS [22.057s]
[INFO] Apache Sling Models Integration Tests ............. FAILURE [2.496s]
[INFO] Apache Sling Internationalization Support ......... SKIPPED
[INFO] Apache Sling XSS Protection Bundle ................ SKIPPED
[INFO] Apache Sling Resource Builder ..................... SKIPPED
[INFO] Apache Sling Servlet Helpers ...................... SKIPPED
[INFO] Apache Sling Test Tools ........................... SKIPPED
[INFO] Apache Sling Testing Hamcrest ..................... SKIPPED
[INFO] Apache Sling JUnit Core ........................... SKIPPED
[INFO] Apache Sling JUnit Scriptable Tests Provider ...... SKIPPED
[INFO] Apache Sling JUnit Health Checks .................. SKIPPED
[INFO] Apache Sling JUnit Remote Tests Runners ........... SKIPPED
[INFO] Apache Sling JUnit Performance .................... SKIPPED
[INFO] Apache Sling Testing Mock Log Configuration ....... SKIPPED
[INFO] Apache Sling Testing Resource Resolver Mock ....... SKIPPED
[INFO] Apache Sling Testing JCR Mock ..................... SKIPPED
[INFO] Apache Sling Testing OSGi Mock .................... SKIPPED
[INFO] Apache Sling Testing Sling Mock ................... SKIPPED
[INFO] Apache Sling Testing Sling Mock Oak-based Resource Resolver  SKIPPED
[INFO] Apache Sling Testing Mocks Modules Reactor ........ SKIPPED
[INFO] Apache Sling Testing - sample bundle with integration tests  SKIPPED
[INFO] Apache Sling Testing Modules Reactor .............. SKIPPED
[INFO] Apache Sling Installer ............................ SKIPPED
[INFO] Apache Sling File Installer ....................... SKIPPED
[INFO] Apache Sling JCR Installer ........................ SKIPPED
[INFO] Apache Sling Installer Configuration Admin Support  SKIPPED
[INFO] Apache Sling Deployment Package Installer ......... SKIPPED
[INFO] Apache Sling Subsystems Installer ................. SKIPPED
[INFO] Apache Sling Installer Integration Tests .......... SKIPPED
[INFO] Apache Sling Launchpad API ........................ SKIPPED
[INFO] Apache Sling Launchpad Installer .................. SKIPPED
[INFO] Apache Sling Launchpad Content .................... SKIPPED
[INFO] Apache Sling Validation Framework API ............. SKIPPED
[INFO] Apache Sling Validation Framework Core Implementation  SKIPPED
[INFO] Apache Sling Validation Framework Testing Services  SKIPPED
[INFO] Apache Sling Validation Framework Integration Tests  SKIPPED
[INFO] Apache Sling Validation Framework Examples ........ SKIPPED
[INFO] Apache Sling Validation Framework Builder ......... SKIPPED
[INFO] Apache Sling Models Validation Implementation ..... SKIPPED
[INFO] Apache Sling (Builder) ............................ SKIPPED
[INFO] ------------------------------------------------------------------------
[INFO] BUILD FAILURE
[INFO] ------------------------------------------------------------------------
[INFO] Total time: 1:34:23.138s
[INFO] Finished at: Tue Apr 19 02:25:43 UTC 2016
[INFO] Final Memory: 197M/363M
[INFO] ------------------------------------------------------------------------
[JENKINS] Archiving disabled
[JENKINS] Archiving disabled
[JENKINS] Archiving disabled
[JENKINS] Archiving disabled
[JENKINS] Archiving disabled
[JENKINS] Archiving disabled
[JENKINS] Archiving disabled
[JENKINS] Archiving disabled
[JENKINS] Archiving disabled
[JENKINS] Archiving disabled
[JENKINS] Archiving disabled
[JENKINS] Archiving disabled
[JENKINS] Archiving disabled
[JENKINS] Archiving disabled
[JENKINS] Archiving disabled
[JENKINS] Archiving disabled
[JENKINS] Archiving disabled
[JENKINS] Archiving disabled
[JENKINS] Archiving disabled
[JENKINS] Archiving disabled
[JENKINS] Archiving disabled
[JENKINS] Archiving disabled
[JENKINS] Archiving disabled
[JENKINS] Archiving disabled
[JENKINS] Archiving disabled
[JENKINS] Archiving disabled
[JENKINS] Archiving disabled
[JENKINS] Archiving disabled
[JENKINS] Archiving disabled
[JENKINS] Archiving disabled
[JENKINS] Archiving disabled
[JENKINS] Archiving disabled
[JENKINS] Archiving disabled
[JENKINS] Archiving disabled
[JENKINS] Archiving disabled
[JENKINS] Archiving disabled
[JENKINS] Archiving disabled
[JENKINS] Archiving disabled
[JENKINS] Archiving disabled
[JENKINS] Archiving disabled
[JENKINS] Archiving disabled
[JENKINS] Archiving disabled
[JENKINS] Archiving disabled
[JENKINS] Archiving disabled
[JENKINS] Archiving disabled
[JENKINS] Archiving disabled
[JENKINS] Archiving disabled
[JENKINS] Archiving disabled
[JENKINS] Archiving disabled
[JENKINS] Archiving disabled
[JENKINS] Archiving disabled
[JENKINS] Archiving disabled
[JENKINS] Archiving disabled
[JENKINS] Archiving disabled
[JENKINS] Archiving disabled
[JENKINS] Archiving disabled
[JENKINS] Archiving disabled
[JENKINS] Archiving disabled
[JENKINS] Archiving disabled
[JENKINS] Archiving disabled
[JENKINS] Archiving disabled
[JENKINS] Archiving disabled
[JENKINS] Archiving disabled
[JENKINS] Archiving disabled
[JENKINS] Archiving disabled
[JENKINS] Archiving disabled
[JENKINS] Archiving disabled
[JENKINS] Archiving disabled
[JENKINS] Archiving disabled
[JENKINS] Archiving disabled
[JENKINS] Archiving disabled
[JENKINS] Archiving disabled
[JENKINS] Archiving disabled
[JENKINS] Archiving disabled
[JENKINS] Archiving disabled
[JENKINS] Archiving disabled
[JENKINS] Archiving disabled
[JENKINS] Archiving disabled
[JENKINS] Archiving disabled
[JENKINS] Archiving disabled
[JENKINS] Archiving disabled
[JENKINS] Archiving disabled
[JENKINS] Archiving disabled
[JENKINS] Archiving disabled
[JENKINS] Archiving disabled
[JENKINS] Archiving disabled
[JENKINS] Archiving disabled
[JENKINS] Archiving disabled
[JENKINS] Archiving disabled
[JENKINS] Archiving disabled
[JENKINS] Archiving disabled
[JENKINS] Archiving disabled
[JENKINS] Archiving disabled
[JENKINS] Archiving disabled
[JENKINS] Archiving disabled
[JENKINS] Archiving disabled
[JENKINS] Archiving disabled
[JENKINS] Archiving disabled
[JENKINS] Archiving disabled
[JENKINS] Archiving disabled
[JENKINS] Archiving disabled
[JENKINS] Archiving disabled
[JENKINS] Archiving disabled
[JENKINS] Archiving disabled
[JENKINS] Archiving disabled
[JENKINS] Archiving disabled
[JENKINS] Archiving disabled
[JENKINS] Archiving disabled
[JENKINS] Archiving disabled
[JENKINS] Archiving disabled
[JENKINS] Archiving disabled
[JENKINS] Archiving disabled
[JENKINS] Archiving disabled
[JENKINS] Archiving disabled
[JENKINS] Archiving disabled
[JENKINS] Archiving disabled
[JENKINS] Archiving disabled
[JENKINS] Archiving disabled
[JENKINS] Archiving disabled
[JENKINS] Archiving disabled
[JENKINS] Archiving disabled
[JENKINS] Archiving disabled
[JENKINS] Archiving disabled
[JENKINS] Archiving disabled
[JENKINS] Archiving disabled
[JENKINS] Archiving disabled
[JENKINS] Archiving disabled
[JENKINS] Archiving disabled
[JENKINS] Archiving disabled
[JENKINS] Archiving disabled
[JENKINS] Archiving disabled
[JENKINS] Archiving disabled
[JENKINS] Archiving disabled
Waiting for Jenkins to finish collecting data
[ERROR] Failed to execute goal org.apache.maven.plugins:maven-compiler-plugin:3.2:compile
(default-compile) on project org.apache.sling.models.integration-tests: Compilation failure:
Compilation failure:
[ERROR] <https://builds.apache.org/job/sling-trunk-1.8/ws/trunk/bundles/extensions/models/integration-tests/src/main/java/org/apache/sling/models/it/ServiceInjectionWithDifferentRankingTest.java>:[57,43]
type org.osgi.framework.ServiceRegistration does not take parameters
[ERROR] <https://builds.apache.org/job/sling-trunk-1.8/ws/trunk/bundles/extensions/models/integration-tests/src/main/java/org/apache/sling/models/it/ServiceInjectionWithDifferentRankingTest.java>:[73,65]
type org.osgi.framework.ServiceRegistration does not take parameters
[ERROR] <https://builds.apache.org/job/sling-trunk-1.8/ws/trunk/bundles/extensions/models/integration-tests/src/main/java/org/apache/sling/models/it/ServiceInjectionWithDifferentRankingTest.java>:[85,33]
type org.osgi.framework.ServiceRegistration does not take parameters
[ERROR] <https://builds.apache.org/job/sling-trunk-1.8/ws/trunk/bundles/extensions/models/integration-tests/src/main/java/org/apache/sling/models/it/ServiceInjectionWithDifferentRankingTest.java>:[93,28]
type org.osgi.framework.ServiceRegistration does not take parameters
[ERROR] -> [Help 1]
[ERROR] 
[ERROR] To see the full stack trace of the errors, re-run Maven with the -e switch.
[ERROR] Re-run Maven using the -X switch to enable full debug logging.
[ERROR] 
[ERROR] For more information about the errors and possible solutions, please read the following
articles:
[ERROR] [Help 1] http://cwiki.apache.org/confluence/display/MAVEN/MojoFailureException
[ERROR] 
[ERROR] After correcting the problems, you can resume the build with the command
[ERROR]   mvn <goals> -rf :org.apache.sling.models.integration-tests
channel stopped

Mime
View raw message