sling-commits mailing list archives

Site index · List index
Message view « Date » · « Thread »
Top « Date » · « Thread »
From Apache Jenkins Server <jenk...@builds.apache.org>
Subject Build failed in Jenkins: sling-contrib-1.7 #771
Date Wed, 10 Feb 2016 09:35:48 GMT
See <https://builds.apache.org/job/sling-contrib-1.7/771/changes>

Changes:

[chetanm] SLING-5459 - Recording of tracer logs

Recording now also includes
-- Log entry timestamp
-- Start time of request
-- Time taken for the request processing

The WebConsole view now shows Recording link in order of occurrence

[chetanm] SLING-5504 - Reduce memory footprint of stored recording data

Clear the request attribute at the end

------------------------------------------
[...truncated 9894 lines...]
[INFO] Copying 3 resources
[INFO] 
[INFO] --- maven-compiler-plugin:3.2:testCompile (default-testCompile) @ org.apache.sling.nosql.couchbase-client
---
[INFO] Changes detected - recompiling the module!
[INFO] Compiling 1 source file to <https://builds.apache.org/job/sling-contrib-1.7/ws/trunk/nosql/couchbase-client/target/test-classes>
[INFO] 
[INFO] --- maven-surefire-plugin:2.18.1:test (default-test) @ org.apache.sling.nosql.couchbase-client
---
[INFO] Surefire report directory: <https://builds.apache.org/job/sling-contrib-1.7/ws/trunk/nosql/couchbase-client/target/surefire-reports>

-------------------------------------------------------
 T E S T S
-------------------------------------------------------
Running org.apache.sling.nosql.couchbase.client.CouchbaseKeyTest
Tests run: 2, Failures: 0, Errors: 0, Skipped: 0, Time elapsed: 0.034 sec - in org.apache.sling.nosql.couchbase.client.CouchbaseKeyTest

Results :

Tests run: 2, Failures: 0, Errors: 0, Skipped: 0

[JENKINS] Recording test results
[INFO] 
[INFO] --- animal-sniffer-maven-plugin:1.14:check (default) @ org.apache.sling.nosql.couchbase-client
---
[INFO] Checking unresolved references to org.codehaus.mojo.signature:java17:1.0
[INFO] 
[INFO] --- maven-bundle-plugin:3.0.1:bundle (default-bundle) @ org.apache.sling.nosql.couchbase-client
---
[WARNING] Bundle org.apache.sling:org.apache.sling.nosql.couchbase-client:bundle:1.0.1-SNAPSHOT
: Export com.couchbase.client.java,  has 2,  private references [com.couchbase.client.core.message.observe,
com.couchbase.client.core], 
[WARNING] Bundle org.apache.sling:org.apache.sling.nosql.couchbase-client:bundle:1.0.1-SNAPSHOT
: Export com.couchbase.client.java.bucket,  has 2,  private references [com.couchbase.client.core.message.kv,
com.couchbase.client.core], 
[WARNING] Bundle org.apache.sling:org.apache.sling.nosql.couchbase-client:bundle:1.0.1-SNAPSHOT
: Export com.couchbase.client.java.cluster,  has 1,  private references [com.couchbase.client.core],

[WARNING] Bundle org.apache.sling:org.apache.sling.nosql.couchbase-client:bundle:1.0.1-SNAPSHOT
: Export com.couchbase.client.java.document,  has 2,  private references [com.couchbase.client.core.message.kv,
com.couchbase.client.deps.io.netty.buffer], 
[WARNING] Bundle org.apache.sling:org.apache.sling.nosql.couchbase-client:bundle:1.0.1-SNAPSHOT
: Export com.couchbase.client.java.env,  has 9,  private references [com.couchbase.client.core.time,
com.couchbase.client.core.logging, com.couchbase.client.core.metrics, com.couchbase.client.core.env.resources,
com.couchbase.client.core.retry, com.couchbase.client.core.event.consumers, com.couchbase.client.core.event,
com.couchbase.client.core.env, com.couchbase.client.deps.io.netty.channel], 
[WARNING] Bundle org.apache.sling:org.apache.sling.nosql.couchbase-client:bundle:1.0.1-SNAPSHOT
: Export com.couchbase.client.java.error,  has 1,  private references [com.couchbase.client.core],

[WARNING] Bundle org.apache.sling:org.apache.sling.nosql.couchbase-client:bundle:1.0.1-SNAPSHOT
: Export com.couchbase.client.java.event.consumers,  has 1,  private references [com.couchbase.client.core.event],

[WARNING] Bundle org.apache.sling:org.apache.sling.nosql.couchbase-client:bundle:1.0.1-SNAPSHOT
: Export com.couchbase.client.java.query,  has 1,  private references [com.couchbase.client.core],

[WARNING] Bundle org.apache.sling:org.apache.sling.nosql.couchbase-client:bundle:1.0.1-SNAPSHOT
: Export com.couchbase.client.java.query.core,  has 1,  private references [com.couchbase.client.core],

[WARNING] Bundle org.apache.sling:org.apache.sling.nosql.couchbase-client:bundle:1.0.1-SNAPSHOT
: Export com.couchbase.client.java.repository.mapping,  has 1,  private references [com.couchbase.client.core],

[WARNING] Bundle org.apache.sling:org.apache.sling.nosql.couchbase-client:bundle:1.0.1-SNAPSHOT
: Export com.couchbase.client.java.transcoder,  has 6,  private references [com.couchbase.client.core.message.kv,
com.couchbase.client.deps.com.fasterxml.jackson.databind, com.couchbase.client.core.lang,
com.couchbase.client.core.message, com.couchbase.client.deps.io.netty.buffer, com.couchbase.client.deps.com.fasterxml.jackson.databind.module],

[WARNING] Bundle org.apache.sling:org.apache.sling.nosql.couchbase-client:bundle:1.0.1-SNAPSHOT
: Export com.couchbase.client.java.util.retry,  has 2,  private references [com.couchbase.client.core.lang,
com.couchbase.client.core.time], 
[WARNING] Bundle org.apache.sling:org.apache.sling.nosql.couchbase-client:bundle:1.0.1-SNAPSHOT
: Export com.couchbase.client.java.view,  has 1,  private references [com.couchbase.client.core.message.view],

[INFO] 
[INFO] --- maven-enforcer-plugin:1.3.1:enforce (enforce-java) @ org.apache.sling.nosql.couchbase-client
---
[INFO] 
[INFO] --- maven-antrun-plugin:1.8:run (set-bundle-required-execution-environment) @ org.apache.sling.nosql.couchbase-client
---
[INFO] Executing tasks

main:
Setting Bundle-RequiredExecutionEnvironment=JavaSE-1.7 from sling.java.version=7
[INFO] Executed tasks
[WARNING] Failed to getClass for org.apache.maven.plugin.source.SourceJarMojo
[INFO] 
[INFO] --- maven-source-plugin:2.4:jar (attach-sources) @ org.apache.sling.nosql.couchbase-client
---
[INFO] Building jar: <https://builds.apache.org/job/sling-contrib-1.7/ws/trunk/nosql/couchbase-client/target/org.apache.sling.nosql.couchbase-client-1.0.1-SNAPSHOT-sources.jar>
[INFO] 
[INFO] --- maven-site-plugin:3.4:attach-descriptor (attach-descriptor) @ org.apache.sling.nosql.couchbase-client
---
[INFO] 
[INFO] --- ianal-maven-plugin:1.0-alpha-1:verify-legal-files (default) @ org.apache.sling.nosql.couchbase-client
---
[INFO] Checking legal files in: org.apache.sling.nosql.couchbase-client-1.0.1-SNAPSHOT.jar
[INFO] Checking legal files in: org.apache.sling.nosql.couchbase-client-1.0.1-SNAPSHOT-sources.jar
[INFO] 
[INFO] --- apache-rat-plugin:0.11:check (default) @ org.apache.sling.nosql.couchbase-client
---
[INFO] 51 implicit excludes (use -debug for more details).
[INFO] Exclude: src/main/appended-resources/META-INF/*
[INFO] Exclude: velocity.log
[INFO] Exclude: target/*
[INFO] Exclude: README.md
[INFO] Exclude: maven-eclipse.xml
[INFO] Exclude: .*
[INFO] Exclude: .*/**
[INFO] Exclude: **/*.json
[INFO] Exclude: DEPENDENCIES
[INFO] Exclude: **/*.rej
[INFO] Exclude: hs_err_*.log
[INFO] 7 resources included (use -debug for more details)
[INFO] Rat check: Summary of files. Unapproved: 0 unknown: 0 generated: 0 approved: 7 licence.
[INFO] 
[INFO] --- maven-bundle-plugin:3.0.1:baseline (baseline) @ org.apache.sling.nosql.couchbase-client
---
[INFO] artifact org.apache.sling:org.apache.sling.nosql.couchbase-client: checking for updates
from Nexus
[INFO] artifact org.apache.sling:org.apache.sling.nosql.couchbase-client: checking for updates
from central
Downloading: http://repo.maven.apache.org/maven2/org/apache/sling/org.apache.sling.nosql.couchbase-client/1.0.0/org.apache.sling.nosql.couchbase-client-1.0.0.jar
[JENKINS] Archiving disabled
[INFO] ------------------------------------------------------------------------
[INFO] Reactor Summary:
[INFO] 
[INFO] Apache Sling OpenID Authentication ................ SUCCESS [39.312s]
[INFO] Apache Sling Authentication XING API .............. SUCCESS [5.617s]
[INFO] Apache Sling Authentication XING Login ............ SUCCESS [8.532s]
[INFO] Apache Sling Authentication XING OAuth ............ SUCCESS [7.930s]
[INFO] Apache Sling Authentication Selector .............. SUCCESS [3.941s]
[INFO] Apache Sling Commons HTML Utilities ............... SUCCESS [4.030s]
[INFO] Apache Sling APT parser ........................... SUCCESS [6.434s]
[INFO] Apache Sling APT servlet .......................... SUCCESS [4.303s]
[INFO] Apache Sling Resource Collection API .............. SUCCESS [5.506s]
[INFO] Apache Sling DataSource Provider .................. SUCCESS [16.119s]
[INFO] Apache Sling Dojo JavaScript Library .............. SUCCESS [10.402s]
[INFO] Apache Sling Dojo Data Extension .................. SUCCESS [1.996s]
[INFO] Apache Sling FTP Server ........................... SUCCESS [6.204s]
[INFO] Apache Sling Google Web Toolkit Servlet Library ... SUCCESS [7.302s]
[INFO] Apache Sling Google Web Toolkit Sample ............ SUCCESS [46.277s]
[INFO] Apache Sling JMX Resource Provider ................ SUCCESS [2.375s]
[INFO] Apache Sling ClassLoader Leak Detector ............ SUCCESS [2.754s]
[INFO] Apache Sling MongoDB Resource Provider ............ SUCCESS [3.072s]
[INFO] Apache Sling OSGi Bundle Repository ............... SUCCESS [4.788s]
[INFO] Apache Sling Distribution API ..................... SUCCESS [2.853s]
[INFO] Apache Sling Distribution Core .................... SUCCESS [14.350s]
[INFO] Apache Sling Distribution Extensions .............. SUCCESS [7.085s]
[INFO] Apache Sling Distribution Sample .................. SUCCESS [3.048s]
[INFO] Apache Sling Distribution Integration Tests ....... SUCCESS [5:09.134s]
[INFO] Apache Sling Log Tail Implementation .............. SUCCESS [8.967s]
[INFO] S3 dependencies for Oak ........................... SUCCESS [8.608s]
[INFO] Apache Sling Request Processing Analyzer .......... SUCCESS [6.727s]
[INFO] Apache Sling Resource Merger ...................... SUCCESS [5.904s]
[INFO] Apache Sling Inventory Printer Based on Resources . SUCCESS [3.661s]
[INFO] Apache Sling Rewriter ............................. SUCCESS [10.161s]
[INFO] Apache Sling Security ............................. SUCCESS [6.016s]
[INFO] Apache Sling SLF4J MDC Filter ..................... SUCCESS [12.011s]
[INFO] Apache Sling Query ................................ SUCCESS [6.199s]
[INFO] Apache Sling Superimposing Resource Provider ...... SUCCESS [4.333s]
[INFO] Apache Sling Tenant ............................... SUCCESS [4.052s]
[INFO] Apache Sling Log Tracer ........................... SUCCESS [5.643s]
[INFO] Apache Sling URL Rewriter ......................... SUCCESS [2.743s]
[INFO] HApi - Sling Hypermedia API tools ................. SUCCESS [2.860s]
[INFO] HApi - Sample Content ............................. SUCCESS [2.416s]
[INFO] HApi - Sling Hypermedia API Tools Reactor ......... SUCCESS [2.958s]
[INFO] Apache Sling JCR Java Compiler .................... SUCCESS [6.576s]
[INFO] Apache Sling Repository Accessor .................. SUCCESS [2.583s]
[INFO] Apache Sling Object Content Mapping ............... SUCCESS [4.997s]
[INFO] Apache Sling JCR Prefs ............................ SUCCESS [2.194s]
[INFO] Apache Sling JCR Resource Security ................ SUCCESS [1.995s]
[INFO] Apache Sling Script Console ....................... SUCCESS [2.698s]
[INFO] Apache Sling Atom Tag Library ..................... SUCCESS [4.047s]
[INFO] Apache Sling Scripting Freemarker Support ......... SUCCESS [12.066s]
[INFO] Apache Sling Scripting Groovy Support ............. SUCCESS [4.148s]
[INFO] Apache Sling Scripting Java Support ............... SUCCESS [3.600s]
[INFO] Apache Sling Scripting JST Support ................ SUCCESS [7.413s]
[INFO] Apache Sling Scripting Python Support ............. SUCCESS [4.006s]
[INFO] Apache Sling Scripting Ruby Support ............... SUCCESS [12.549s]
[INFO] Scala Script Engine ............................... SUCCESS [1:05.513s]
[INFO] Apache Sling Scala Scripting Configuration ........ SUCCESS [3.429s]
[INFO] Scala for Sling Demo Application - Hello World .... SUCCESS [2.266s]
[INFO] Scala for Sling Demo Application - Forum .......... SUCCESS [2.496s]
[INFO] Apache Sling Scripting Thymeleaf .................. SUCCESS [11.234s]
[INFO] Apache Sling Scripting Velocity Support ........... SUCCESS [3.817s]
[INFO] Apache Sling Scripting W3C XML Processing Support . SUCCESS [4.045s]
[INFO] Apache Sling NoSQL Generic Resource Provider ...... SUCCESS [7.532s]
[INFO] Apache Sling NoSQL Couchbase Client ............... FAILURE [1:05.662s]
[INFO] Apache Sling NoSQL Couchbase Resource Provider .... SKIPPED
[INFO] Apache Sling NoSQL MongoDB Resource Provider ...... SKIPPED
[INFO] Apache Sling Launchpad Contrib Testing ............ SKIPPED
[INFO] Apache Sling Launchpad Karaf - Features ........... SKIPPED
[INFO] Apache Sling Launchpad Karaf - Distribution ....... SKIPPED
[INFO] Apache Sling Launchpad Karaf - Integration Tests .. SKIPPED
[INFO] Apache Sling Launchpad Karaf - Launchpad Oak Tar Integration Tests  SKIPPED
[INFO] Apache Sling Launchpad Karaf Builder .............. SKIPPED
[INFO] Apache Sling Contrib (Builder) .................... SKIPPED
[INFO] ------------------------------------------------------------------------
[INFO] BUILD FAILURE
[INFO] ------------------------------------------------------------------------
[INFO] Total time: 14:46.598s
[INFO] Finished at: Wed Feb 10 09:35:15 UTC 2016
[INFO] Final Memory: 136M/419M
[INFO] ------------------------------------------------------------------------
[JENKINS] Archiving disabled
[JENKINS] Archiving disabled
[JENKINS] Archiving disabled
[JENKINS] Archiving disabled
[JENKINS] Archiving disabled
[JENKINS] Archiving disabled
[JENKINS] Archiving disabled
[JENKINS] Archiving disabled
[JENKINS] Archiving disabled
[JENKINS] Archiving disabled
[JENKINS] Archiving disabled
[JENKINS] Archiving disabled
[JENKINS] Archiving disabled
[JENKINS] Archiving disabled
[JENKINS] Archiving disabled
[JENKINS] Archiving disabled
[JENKINS] Archiving disabled
[JENKINS] Archiving disabled
[JENKINS] Archiving disabled
[JENKINS] Archiving disabled
[JENKINS] Archiving disabled
[JENKINS] Archiving disabled
[JENKINS] Archiving disabled
[JENKINS] Archiving disabled
[JENKINS] Archiving disabled
[JENKINS] Archiving disabled
[JENKINS] Archiving disabled
[JENKINS] Archiving disabled
[JENKINS] Archiving disabled
[JENKINS] Archiving disabled
[JENKINS] Archiving disabled
[JENKINS] Archiving disabled
[JENKINS] Archiving disabled
[JENKINS] Archiving disabled
[JENKINS] Archiving disabled
[JENKINS] Archiving disabled
[JENKINS] Archiving disabled
[JENKINS] Archiving disabled
[JENKINS] Archiving disabled
[JENKINS] Archiving disabled
[JENKINS] Archiving disabled
[JENKINS] Archiving disabled
[JENKINS] Archiving disabled
[JENKINS] Archiving disabled
[JENKINS] Archiving disabled
[JENKINS] Archiving disabled
[JENKINS] Archiving disabled
[JENKINS] Archiving disabled
[JENKINS] Archiving disabled
[JENKINS] Archiving disabled
[JENKINS] Archiving disabled
[JENKINS] Archiving disabled
[JENKINS] Archiving disabled
[JENKINS] Archiving disabled
[JENKINS] Archiving disabled
[JENKINS] Archiving disabled
[JENKINS] Archiving disabled
[JENKINS] Archiving disabled
[JENKINS] Archiving disabled
[JENKINS] Archiving disabled
[JENKINS] Archiving disabled
[JENKINS] Archiving disabled
[JENKINS] Archiving disabled
[JENKINS] Archiving disabled
[JENKINS] Archiving disabled
[JENKINS] Archiving disabled
[JENKINS] Archiving disabled
[JENKINS] Archiving disabled
[JENKINS] Archiving disabled
[JENKINS] Archiving disabled
[JENKINS] Archiving disabled
Waiting for Jenkins to finish collecting data
[ERROR] Failed to execute goal org.apache.felix:maven-bundle-plugin:3.0.1:baseline (baseline)
on project org.apache.sling.nosql.couchbase-client: Artifact org.apache.sling:org.apache.sling.nosql.couchbase-client:bundle:1.0.0:compile
cannot be resolved : Could not transfer artifact org.apache.sling:org.apache.sling.nosql.couchbase-client:jar:1.0.0
from/to central (http://repo.maven.apache.org/maven2): Failed to transfer file: http://repo.maven.apache.org/maven2/org/apache/sling/org.apache.sling.nosql.couchbase-client/1.0.0/org.apache.sling.nosql.couchbase-client-1.0.0.jar.
Return code is: 503 , ReasonPhrase:backend read error.
[ERROR] org.apache.sling:org.apache.sling.nosql.couchbase-client:bundle:1.0.0
[ERROR] 
[ERROR] from the specified remote repositories:
[ERROR] Nexus (http://repository.apache.org/snapshots, releases=false, snapshots=true),
[ERROR] central (http://repo.maven.apache.org/maven2, releases=true, snapshots=false)
[ERROR] -> [Help 1]
[ERROR] 
[ERROR] To see the full stack trace of the errors, re-run Maven with the -e switch.
[ERROR] Re-run Maven using the -X switch to enable full debug logging.
[ERROR] 
[ERROR] For more information about the errors and possible solutions, please read the following
articles:
[ERROR] [Help 1] http://cwiki.apache.org/confluence/display/MAVEN/MojoExecutionException
[ERROR] 
[ERROR] After correcting the problems, you can resume the build with the command
[ERROR]   mvn <goals> -rf :org.apache.sling.nosql.couchbase-client
channel stopped

Mime
View raw message