sling-commits mailing list archives

Site index · List index
Message view « Date » · « Thread »
Top « Date » · « Thread »
From Apache Jenkins Server <jenk...@builds.apache.org>
Subject Build failed in Jenkins: sling-trunk-1.7 #3317
Date Fri, 05 Feb 2016 22:51:35 GMT
See <https://builds.apache.org/job/sling-trunk-1.7/3317/changes>

Changes:

[sseifert] update mock dependencies to latest versions

[sseifert] [maven-release-plugin] prepare for next development iteration

[sseifert] [maven-release-plugin] prepare release org.apache.sling.testing.resourceresolver-mock-1.1.12

[sseifert] [maven-release-plugin] prepare for next development iteration

[sseifert] [maven-release-plugin] prepare release org.apache.sling.servlet-helpers-1.0.0

[sseifert] [maven-release-plugin] prepare for next development iteration

[sseifert] [maven-release-plugin] prepare release org.apache.sling.testing.jcr-mock-1.1.12

[sseifert] [maven-release-plugin] prepare for next development iteration

[sseifert] [maven-release-plugin] prepare release org.apache.sling.testing.osgi-mock-2.0.2

[sseifert] SLING-5161 adapt to latest signature of the new methods

[sseifert] SLING-5490 Add locale support to MockSlingHttpServletRequest and MockSlingHttpServletResponse

------------------------------------------
[...truncated 32638 lines...]
[INFO] Apache Sling Scripting Sightly Read-Eval-Print Loop Environment  SKIPPED
[INFO] Apache Sling Scripting Sightly Integration Tests Content  SKIPPED
[INFO] Apache Sling Scripting Sightly Integration Tests .. SKIPPED
[INFO] Apache Sling Scripting Sightly Reactor ............ SKIPPED
[INFO] Apache Sling Adapter Manager Implementation ....... SKIPPED
[INFO] Apache Sling Bundle Resource Provider ............. SKIPPED
[INFO] Apache Sling Distributed Event Admin .............. SKIPPED
[INFO] Apache Sling Discovery API ........................ SKIPPED
[INFO] Apache Sling Discovery Commons .................... SKIPPED
[INFO] Apache Sling Discovery Base ....................... SKIPPED
[INFO] Apache Sling Resource-Based Discovery Service ..... SKIPPED
[INFO] Apache Sling Oak-Based Discovery Service .......... SKIPPED
[INFO] Apache Sling Discovery Support Bundle ............. SKIPPED
[INFO] Apache Sling Discovery Standalone Implementation .. SKIPPED
[INFO] Apache Sling Event Support ........................ SKIPPED
[INFO] Apache Sling Feature Flags ........................ SKIPPED
[INFO] Apache Sling javax.activation bundle .............. SKIPPED
[INFO] Apache Sling Service User Mapper .................. SKIPPED
[INFO] Apache Sling Settings ............................. SKIPPED
[INFO] Apache Sling Web Console Branding ................. SKIPPED
[INFO] Apache Sling Web Console Security Provider ........ SKIPPED
[INFO] Apache Sling Explorer ............................. SKIPPED
[INFO] Apache Sling Health Check Core .................... SKIPPED
[INFO] Apache Sling Health Check Annotations ............. SKIPPED
[INFO] Apache Sling Health Check Samples ................. SKIPPED
[INFO] Apache Sling Health Check Support Components ...... SKIPPED
[INFO] Apache Sling Health Check Webconsole Plugin ....... SKIPPED
[INFO] Apache Sling Health Check JUnit Bridge ............ SKIPPED
[INFO] Apache Sling Health Check Integration Tests ....... SKIPPED
[INFO] Apache Sling Health Check Reactor POM ............. SKIPPED
[INFO] Apache Sling Resource Access Security ............. SKIPPED
[INFO] Apache Sling Resource Access Security Integration Tests  SKIPPED
[INFO] Apache Sling Validation Framework API ............. SKIPPED
[INFO] Apache Sling Validation Framework Core Implementation  SKIPPED
[INFO] Apache Sling Validation Framework Testing Services  SKIPPED
[INFO] Apache Sling Validation Framework Integration Tests  SKIPPED
[INFO] Apache Sling Validation Framework Examples ........ SKIPPED
[INFO] Apache Sling Validation Framework Builder ......... SKIPPED
[INFO] Apache Sling Models API ........................... SKIPPED
[INFO] Apache Sling Models Implementation ................ SKIPPED
[INFO] Apache Sling Models Validation Implementation ..... SKIPPED
[INFO] Apache Sling Models Integration Tests ............. SKIPPED
[INFO] Apache Sling Internationalization Support ......... SKIPPED
[INFO] Apache Sling XSS Protection Bundle ................ SKIPPED
[INFO] Apache Sling Resource Builder ..................... SKIPPED
[INFO] Apache Sling Servlet Helpers ...................... SKIPPED
[INFO] Apache Sling Test Tools ........................... SKIPPED
[INFO] Apache Sling Testing Hamcrest ..................... SKIPPED
[INFO] Apache Sling JUnit Core ........................... SKIPPED
[INFO] Apache Sling JUnit Scriptable Tests Provider ...... SKIPPED
[INFO] Apache Sling JUnit Health Checks .................. SKIPPED
[INFO] Apache Sling JUnit Remote Tests Runners ........... SKIPPED
[INFO] Apache Sling JUnit Performance .................... SKIPPED
[INFO] Apache Sling Testing Mock Log Configuration ....... SKIPPED
[INFO] Apache Sling Testing Resource Resolver Mock ....... SKIPPED
[INFO] Apache Sling Testing JCR Mock ..................... SKIPPED
[INFO] Apache Sling Testing OSGi Mock .................... SKIPPED
[INFO] Apache Sling Testing Sling Mock ................... SKIPPED
[INFO] Apache Sling Testing Sling Mock Jackrabbit-based Resource Resolver  SKIPPED
[INFO] Apache Sling Sample Server-Side Tests ............. SKIPPED
[INFO] Apache Sling Failing Server-Side Tests ............ SKIPPED
[INFO] Apache Sling Sample Integration Tests ............. SKIPPED
[INFO] Apache Sling Testing - sample bundle with integration tests  SKIPPED
[INFO] Apache Sling Testing Modules Reactor .............. SKIPPED
[INFO] Apache Sling Installer ............................ SKIPPED
[INFO] Apache Sling File Installer ....................... SKIPPED
[INFO] Apache Sling Installer Configuration Admin Support  SKIPPED
[INFO] Apache Sling Deployment Package Installer ......... SKIPPED
[INFO] Apache Sling Subsystems Installer ................. SKIPPED
[INFO] Apache Sling Installer Integration Tests .......... SKIPPED
[INFO] Apache Sling Launchpad API ........................ SKIPPED
[INFO] Apache Sling Launchpad Base ....................... SKIPPED
[INFO] Apache Sling Launchpad Installer .................. SKIPPED
[INFO] Apache Sling Launchpad Content .................... SKIPPED
[INFO] Apache Sling Launchpad Application Builder ........ SKIPPED
[INFO] Apache Sling Launchpad Testing Services ........... SKIPPED
[INFO] Apache Sling Launchpad Testing Services WAR ....... SKIPPED
[INFO] Apache Sling Launchpad Testing Fragment Bundle .... SKIPPED
[INFO] Apache Sling Launchpad Test Bundles ............... SKIPPED
[INFO] Apache Sling Integration Tests .................... SKIPPED
[INFO] Apache Sling Launchpad Testing .................... SKIPPED
[INFO] Apache Sling (Builder) ............................ SKIPPED
[INFO] ------------------------------------------------------------------------
[INFO] BUILD FAILURE
[INFO] ------------------------------------------------------------------------
[INFO] Total time: 10:54.501s
[INFO] Finished at: Fri Feb 05 22:51:12 UTC 2016
[INFO] Final Memory: 141M/478M
[INFO] ------------------------------------------------------------------------
[JENKINS] Archiving disabled
[JENKINS] Archiving disabled
[JENKINS] Archiving disabled
[JENKINS] Archiving disabled
[JENKINS] Archiving disabled
[JENKINS] Archiving disabled
[JENKINS] Archiving disabled
[JENKINS] Archiving disabled
[JENKINS] Archiving disabled
[JENKINS] Archiving disabled
[JENKINS] Archiving disabled
[JENKINS] Archiving disabled
[JENKINS] Archiving disabled
[JENKINS] Archiving disabled
[JENKINS] Archiving disabled
[JENKINS] Archiving disabled
[JENKINS] Archiving disabled
[JENKINS] Archiving disabled
[JENKINS] Archiving disabled
[JENKINS] Archiving disabled
[JENKINS] Archiving disabled
[JENKINS] Archiving disabled
[JENKINS] Archiving disabled
[JENKINS] Archiving disabled
[JENKINS] Archiving disabled
[JENKINS] Archiving disabled
[JENKINS] Archiving disabled
[JENKINS] Archiving disabled
[JENKINS] Archiving disabled
[JENKINS] Archiving disabled
[JENKINS] Archiving disabled
[JENKINS] Archiving disabled
[JENKINS] Archiving disabled
[JENKINS] Archiving disabled
[JENKINS] Archiving disabled
[JENKINS] Archiving disabled
[JENKINS] Archiving disabled
[JENKINS] Archiving disabled
[JENKINS] Archiving disabled
[JENKINS] Archiving disabled
[JENKINS] Archiving disabled
[JENKINS] Archiving disabled
[JENKINS] Archiving disabled
[JENKINS] Archiving disabled
[JENKINS] Archiving disabled
[JENKINS] Archiving disabled
[JENKINS] Archiving disabled
[JENKINS] Archiving disabled
[JENKINS] Archiving disabled
[JENKINS] Archiving disabled
[JENKINS] Archiving disabled
[JENKINS] Archiving disabled
[JENKINS] Archiving disabled
[JENKINS] Archiving disabled
[JENKINS] Archiving disabled
[JENKINS] Archiving disabled
[JENKINS] Archiving disabled
[JENKINS] Archiving disabled
[JENKINS] Archiving disabled
[JENKINS] Archiving disabled
[JENKINS] Archiving disabled
[JENKINS] Archiving disabled
[JENKINS] Archiving disabled
[JENKINS] Archiving disabled
[JENKINS] Archiving disabled
[JENKINS] Archiving disabled
[JENKINS] Archiving disabled
[JENKINS] Archiving disabled
[JENKINS] Archiving disabled
[JENKINS] Archiving disabled
[JENKINS] Archiving disabled
[JENKINS] Archiving disabled
[JENKINS] Archiving disabled
[JENKINS] Archiving disabled
[JENKINS] Archiving disabled
[JENKINS] Archiving disabled
[JENKINS] Archiving disabled
[JENKINS] Archiving disabled
[JENKINS] Archiving disabled
[JENKINS] Archiving disabled
[JENKINS] Archiving disabled
[JENKINS] Archiving disabled
[JENKINS] Archiving disabled
[JENKINS] Archiving disabled
[JENKINS] Archiving disabled
[JENKINS] Archiving disabled
[JENKINS] Archiving disabled
[JENKINS] Archiving disabled
[JENKINS] Archiving disabled
[JENKINS] Archiving disabled
[JENKINS] Archiving disabled
[JENKINS] Archiving disabled
[JENKINS] Archiving disabled
[JENKINS] Archiving disabled
[JENKINS] Archiving disabled
[JENKINS] Archiving disabled
[JENKINS] Archiving disabled
[JENKINS] Archiving disabled
[JENKINS] Archiving disabled
[JENKINS] Archiving disabled
[JENKINS] Archiving disabled
[JENKINS] Archiving disabled
[JENKINS] Archiving disabled
[JENKINS] Archiving disabled
[JENKINS] Archiving disabled
[JENKINS] Archiving disabled
[JENKINS] Archiving disabled
[JENKINS] Archiving disabled
[JENKINS] Archiving disabled
[JENKINS] Archiving disabled
[JENKINS] Archiving disabled
[JENKINS] Archiving disabled
[JENKINS] Archiving disabled
[JENKINS] Archiving disabled
[JENKINS] Archiving disabled
[JENKINS] Archiving disabled
[JENKINS] Archiving disabled
[JENKINS] Archiving disabled
[JENKINS] Archiving disabled
[JENKINS] Archiving disabled
[JENKINS] Archiving disabled
[JENKINS] Archiving disabled
[JENKINS] Archiving disabled
[JENKINS] Archiving disabled
[JENKINS] Archiving disabled
[JENKINS] Archiving disabled
[JENKINS] Archiving disabled
[JENKINS] Archiving disabled
[JENKINS] Archiving disabled
[JENKINS] Archiving disabled
[JENKINS] Archiving disabled
[JENKINS] Archiving disabled
[JENKINS] Archiving disabled
[JENKINS] Archiving disabled
[JENKINS] Archiving disabled
[JENKINS] Archiving disabled
[JENKINS] Archiving disabled
[JENKINS] Archiving disabled
[JENKINS] Archiving disabled
[JENKINS] Archiving disabled
[JENKINS] Archiving disabled
[JENKINS] Archiving disabled
[JENKINS] Archiving disabled
[JENKINS] Archiving disabled
[JENKINS] Archiving disabled
[JENKINS] Archiving disabled
[JENKINS] Archiving disabled
[JENKINS] Archiving disabled
Waiting for Jenkins to finish collecting data
[ERROR] Failed to execute goal on project org.apache.sling.repoinit.it: Could not resolve
dependencies for project org.apache.sling:org.apache.sling.repoinit.it:slingstart:0.0.1-SNAPSHOT:
Could not find artifact org.apache.sling:org.apache.sling.api:jar:2.12.1-SNAPSHOT in Nexus
(http://repository.apache.org/snapshots) -> [Help 1]
[ERROR] 
[ERROR] To see the full stack trace of the errors, re-run Maven with the -e switch.
[ERROR] Re-run Maven using the -X switch to enable full debug logging.
[ERROR] 
[ERROR] For more information about the errors and possible solutions, please read the following
articles:
[ERROR] [Help 1] http://cwiki.apache.org/confluence/display/MAVEN/DependencyResolutionException
[ERROR] 
[ERROR] After correcting the problems, you can resume the build with the command
[ERROR]   mvn <goals> -rf :org.apache.sling.repoinit.it
channel stopped

Mime
View raw message