sling-commits mailing list archives

Site index · List index
Message view « Date » · « Thread »
Top « Date » · « Thread »
From Apache Jenkins Server <jenk...@builds.apache.org>
Subject Build failed in Jenkins: sling-trunk-1.8 #2484
Date Sat, 23 Jan 2016 19:47:57 GMT
See <https://builds.apache.org/job/sling-trunk-1.8/2484/>

------------------------------------------
[...truncated 731872 lines...]
[INFO] Apache Sling Discovery Commons .................... SUCCESS [2:42.974s]
[INFO] Apache Sling Discovery Base ....................... SUCCESS [1:01.815s]
[INFO] Apache Sling Resource-Based Discovery Service ..... SUCCESS [19:36.418s]
[INFO] Apache Sling Oak-Based Discovery Service .......... SUCCESS [11:39.376s]
[INFO] Apache Sling Discovery Support Bundle ............. SUCCESS [3.998s]
[INFO] Apache Sling Discovery Standalone Implementation .. SUCCESS [5.992s]
[INFO] Apache Sling Event Support ........................ SUCCESS [10:15.235s]
[INFO] Apache Sling Feature Flags ........................ SUCCESS [1.805s]
[INFO] Apache Sling javax.activation bundle .............. SUCCESS [1.824s]
[INFO] Apache Sling Service User Mapper .................. SUCCESS [2.887s]
[INFO] Apache Sling Settings ............................. SUCCESS [2.651s]
[INFO] Apache Sling Web Console Branding ................. SUCCESS [1.676s]
[INFO] Apache Sling Web Console Security Provider ........ SUCCESS [1.922s]
[INFO] Apache Sling Explorer ............................. SUCCESS [1.799s]
[INFO] Apache Sling Health Check Core .................... SUCCESS [7.891s]
[INFO] Apache Sling Health Check Annotations ............. SUCCESS [1.597s]
[INFO] Apache Sling Health Check Samples ................. SUCCESS [3.423s]
[INFO] Apache Sling Health Check Support Components ...... SUCCESS [2.702s]
[INFO] Apache Sling Health Check Webconsole Plugin ....... SUCCESS [1.852s]
[INFO] Apache Sling Health Check JUnit Bridge ............ SUCCESS [2.668s]
[INFO] Apache Sling Health Check Integration Tests ....... SUCCESS [25.532s]
[INFO] Apache Sling Health Check Reactor POM ............. SUCCESS [1.106s]
[INFO] Apache Sling Resource Access Security ............. SUCCESS [1.979s]
[INFO] Apache Sling Test Tools ........................... SUCCESS [2.929s]
[INFO] Apache Sling Resource Access Security Integration Tests  SUCCESS [22.685s]
[INFO] Apache Sling Validation Framework API ............. SUCCESS [2.376s]
[INFO] Apache Sling Validation Framework Core Implementation  SUCCESS [4.575s]
[INFO] Apache Sling Validation Framework Testing Services  SUCCESS [2.628s]
[INFO] Apache Sling Validation Framework Integration Tests  SUCCESS [24.140s]
[INFO] Apache Sling Validation Framework Examples ........ SUCCESS [2.185s]
[INFO] Apache Sling Validation Framework Builder ......... SUCCESS [1.916s]
[INFO] Apache Sling Models API ........................... FAILURE [2.861s]
[INFO] Apache Sling Models Implementation ................ SKIPPED
[INFO] Apache Sling Models Validation Implementation ..... SKIPPED
[INFO] Apache Sling Models Integration Tests ............. SKIPPED
[INFO] Apache Sling Internationalization Support ......... SKIPPED
[INFO] Apache Sling XSS Protection Bundle ................ SKIPPED
[INFO] Apache Sling Resource Builder ..................... SKIPPED
[INFO] Apache Sling Servlet Helpers ...................... SKIPPED
[INFO] Apache Sling Testing Hamcrest ..................... SKIPPED
[INFO] Apache Sling JUnit Core ........................... SKIPPED
[INFO] Apache Sling JUnit Scriptable Tests Provider ...... SKIPPED
[INFO] Apache Sling JUnit Health Checks .................. SKIPPED
[INFO] Apache Sling JUnit Remote Tests Runners ........... SKIPPED
[INFO] Apache Sling JUnit Performance .................... SKIPPED
[INFO] Apache Sling JUnit Tests Teleporter ............... SKIPPED
[INFO] Apache Sling Testing Mock Log Configuration ....... SKIPPED
[INFO] Apache Sling Testing Resource Resolver Mock ....... SKIPPED
[INFO] Apache Sling Testing JCR Mock ..................... SKIPPED
[INFO] Apache Sling Testing OSGi Mock .................... SKIPPED
[INFO] Apache Sling Testing Sling Mock ................... SKIPPED
[INFO] Apache Sling Testing Sling Mock Jackrabbit-based Resource Resolver  SKIPPED
[INFO] Apache Sling Sample Server-Side Tests ............. SKIPPED
[INFO] Apache Sling Failing Server-Side Tests ............ SKIPPED
[INFO] Apache Sling Sample Integration Tests ............. SKIPPED
[INFO] Apache Sling Testing - sample bundle with integration tests  SKIPPED
[INFO] Apache Sling Testing Modules Reactor .............. SKIPPED
[INFO] Apache Sling Installer ............................ SKIPPED
[INFO] Apache Sling File Installer ....................... SKIPPED
[INFO] Apache Sling JCR Installer ........................ SKIPPED
[INFO] Apache Sling Installer Configuration Admin Support  SKIPPED
[INFO] Apache Sling Deployment Package Installer ......... SKIPPED
[INFO] Apache Sling Subsystems Installer ................. SKIPPED
[INFO] Apache Sling Installer Integration Tests .......... SKIPPED
[INFO] Apache Sling Launchpad API ........................ SKIPPED
[INFO] Apache Sling Launchpad Base ....................... SKIPPED
[INFO] Apache Sling Launchpad Installer .................. SKIPPED
[INFO] Apache Sling Launchpad Content .................... SKIPPED
[INFO] Apache Sling Launchpad Application Builder ........ SKIPPED
[INFO] Apache Sling Launchpad Testing Services ........... SKIPPED
[INFO] Apache Sling Launchpad Testing Services WAR ....... SKIPPED
[INFO] Apache Sling Launchpad Testing Fragment Bundle .... SKIPPED
[INFO] Apache Sling Launchpad Test Bundles ............... SKIPPED
[INFO] Apache Sling Integration Tests .................... SKIPPED
[INFO] Apache Sling Launchpad Testing .................... SKIPPED
[INFO] Apache Sling (Builder) ............................ SKIPPED
[INFO] ------------------------------------------------------------------------
[INFO] BUILD FAILURE
[INFO] ------------------------------------------------------------------------
[INFO] Total time: 1:03:36.467s
[INFO] Finished at: Sat Jan 23 19:46:52 UTC 2016
[INFO] Final Memory: 203M/470M
[INFO] ------------------------------------------------------------------------
[JENKINS] Archiving disabled
[JENKINS] Archiving disabled
[JENKINS] Archiving disabled
[JENKINS] Archiving disabled
[JENKINS] Archiving disabled
[JENKINS] Archiving disabled
[JENKINS] Archiving disabled
[JENKINS] Archiving disabled
[JENKINS] Archiving disabled
[JENKINS] Archiving disabled
[JENKINS] Archiving disabled
[JENKINS] Archiving disabled
[JENKINS] Archiving disabled
[JENKINS] Archiving disabled
[JENKINS] Archiving disabled
[JENKINS] Archiving disabled
[JENKINS] Archiving disabled
[JENKINS] Archiving disabled
[JENKINS] Archiving disabled
[JENKINS] Archiving disabled
[JENKINS] Archiving disabled
[JENKINS] Archiving disabled
[JENKINS] Archiving disabled
[JENKINS] Archiving disabled
[JENKINS] Archiving disabled
[JENKINS] Archiving disabled
[JENKINS] Archiving disabled
[JENKINS] Archiving disabled
[JENKINS] Archiving disabled
[JENKINS] Archiving disabled
[JENKINS] Archiving disabled
[JENKINS] Archiving disabled
[JENKINS] Archiving disabled
[JENKINS] Archiving disabled
[JENKINS] Archiving disabled
[JENKINS] Archiving disabled
[JENKINS] Archiving disabled
[JENKINS] Archiving disabled
[JENKINS] Archiving disabled
[JENKINS] Archiving disabled
[JENKINS] Archiving disabled
[JENKINS] Archiving disabled
[JENKINS] Archiving disabled
[JENKINS] Archiving disabled
[JENKINS] Archiving disabled
[JENKINS] Archiving disabled
[JENKINS] Archiving disabled
[JENKINS] Archiving disabled
[JENKINS] Archiving disabled
[JENKINS] Archiving disabled
[JENKINS] Archiving disabled
[JENKINS] Archiving disabled
[JENKINS] Archiving disabled
[JENKINS] Archiving disabled
[JENKINS] Archiving disabled
[JENKINS] Archiving disabled
[JENKINS] Archiving disabled
[JENKINS] Archiving disabled
[JENKINS] Archiving disabled
[JENKINS] Archiving disabled
[JENKINS] Archiving disabled
[JENKINS] Archiving disabled
[JENKINS] Archiving disabled
[JENKINS] Archiving disabled
[JENKINS] Archiving disabled
[JENKINS] Archiving disabled
[JENKINS] Archiving disabled
[JENKINS] Archiving disabled
[JENKINS] Archiving disabled
[JENKINS] Archiving disabled
[JENKINS] Archiving disabled
[JENKINS] Archiving disabled
[JENKINS] Archiving disabled
[JENKINS] Archiving disabled
[JENKINS] Archiving disabled
[JENKINS] Archiving disabled
[JENKINS] Archiving disabled
[JENKINS] Archiving disabled
[JENKINS] Archiving disabled
[JENKINS] Archiving disabled
[JENKINS] Archiving disabled
[JENKINS] Archiving disabled
[JENKINS] Archiving disabled
[JENKINS] Archiving disabled
[JENKINS] Archiving disabled
[JENKINS] Archiving disabled
[JENKINS] Archiving disabled
[JENKINS] Archiving disabled
[JENKINS] Archiving disabled
[JENKINS] Archiving disabled
[JENKINS] Archiving disabled
[JENKINS] Archiving disabled
[JENKINS] Archiving disabled
[JENKINS] Archiving disabled
[JENKINS] Archiving disabled
[JENKINS] Archiving disabled
[JENKINS] Archiving disabled
[JENKINS] Archiving disabled
[JENKINS] Archiving disabled
[JENKINS] Archiving disabled
[JENKINS] Archiving disabled
[JENKINS] Archiving disabled
[JENKINS] Archiving disabled
[JENKINS] Archiving disabled
[JENKINS] Archiving disabled
[JENKINS] Archiving disabled
[JENKINS] Archiving disabled
[JENKINS] Archiving disabled
[JENKINS] Archiving disabled
[JENKINS] Archiving disabled
[JENKINS] Archiving disabled
[JENKINS] Archiving disabled
[JENKINS] Archiving disabled
[JENKINS] Archiving disabled
[JENKINS] Archiving disabled
[JENKINS] Archiving disabled
[JENKINS] Archiving disabled
[JENKINS] Archiving disabled
[JENKINS] Archiving disabled
[JENKINS] Archiving disabled
[JENKINS] Archiving disabled
[JENKINS] Archiving disabled
[JENKINS] Archiving disabled
[JENKINS] Archiving disabled
[JENKINS] Archiving disabled
[JENKINS] Archiving disabled
[JENKINS] Archiving disabled
[JENKINS] Archiving disabled
[JENKINS] Archiving disabled
[JENKINS] Archiving disabled
[JENKINS] Archiving disabled
[JENKINS] Archiving disabled
[JENKINS] Archiving disabled
[JENKINS] Archiving disabled
[JENKINS] Archiving disabled
[JENKINS] Archiving disabled
[JENKINS] Archiving disabled
[JENKINS] Archiving disabled
[JENKINS] Archiving disabled
[JENKINS] Archiving disabled
[JENKINS] Archiving disabled
[JENKINS] Archiving disabled
[JENKINS] Archiving disabled
[JENKINS] Archiving disabled
[JENKINS] Archiving disabled
[JENKINS] Archiving disabled
[JENKINS] Archiving disabled
[JENKINS] Archiving disabled
Waiting for Jenkins to finish collecting data
[ERROR] Failed to execute goal org.apache.maven.plugins:maven-compiler-plugin:3.2:compile
(default-compile) on project org.apache.sling.models.api: Compilation failure: Compilation
failure:
[ERROR] <https://builds.apache.org/job/sling-trunk-1.8/ws/trunk/bundles/extensions/models/api/src/main/java/org/apache/sling/models/spi/injectorspecific/package-info.java>:[18,1]
annotation type not applicable to this kind of declaration
[ERROR] <https://builds.apache.org/job/sling-trunk-1.8/ws/trunk/bundles/extensions/models/api/src/main/java/org/apache/sling/models/annotations/injectorspecific/package-info.java>:[18,1]
annotation type not applicable to this kind of declaration
[ERROR] <https://builds.apache.org/job/sling-trunk-1.8/ws/trunk/bundles/extensions/models/api/src/main/java/org/apache/sling/models/spi/package-info.java>:[18,1]
annotation type not applicable to this kind of declaration
[ERROR] <https://builds.apache.org/job/sling-trunk-1.8/ws/trunk/bundles/extensions/models/api/src/main/java/org/apache/sling/models/annotations/package-info.java>:[18,1]
annotation type not applicable to this kind of declaration
[ERROR] <https://builds.apache.org/job/sling-trunk-1.8/ws/trunk/bundles/extensions/models/api/src/main/java/org/apache/sling/models/factory/package-info.java>:[18,1]
annotation type not applicable to this kind of declaration
[ERROR] -> [Help 1]
[ERROR] 
[ERROR] To see the full stack trace of the errors, re-run Maven with the -e switch.
[ERROR] Re-run Maven using the -X switch to enable full debug logging.
[ERROR] 
[ERROR] For more information about the errors and possible solutions, please read the following
articles:
[ERROR] [Help 1] http://cwiki.apache.org/confluence/display/MAVEN/MojoFailureException
[ERROR] 
[ERROR] After correcting the problems, you can resume the build with the command
[ERROR]   mvn <goals> -rf :org.apache.sling.models.api
channel stopped

Mime
View raw message