sling-commits mailing list archives

Site index · List index
Message view « Date » · « Thread »
Top « Date » · « Thread »
From Apache Jenkins Server <jenk...@builds.apache.org>
Subject Build failed in Jenkins: sling-trunk-1.8 #2482
Date Sat, 23 Jan 2016 11:14:23 GMT
See <https://builds.apache.org/job/sling-trunk-1.8/2482/changes>

Changes:

[kwin] SLING-5450 adjust artifactId and groupId of bndlib

------------------------------------------
[...truncated 737337 lines...]
[INFO] Apache Sling Discovery Commons .................... SUCCESS [3:58.975s]
[INFO] Apache Sling Discovery Base ....................... SUCCESS [1:27.985s]
[INFO] Apache Sling Resource-Based Discovery Service ..... SUCCESS [23:06.981s]
[INFO] Apache Sling Oak-Based Discovery Service .......... SUCCESS [12:47.265s]
[INFO] Apache Sling Discovery Support Bundle ............. SUCCESS [5.072s]
[INFO] Apache Sling Discovery Standalone Implementation .. SUCCESS [18.435s]
[INFO] Apache Sling Event Support ........................ SUCCESS [21:11.894s]
[INFO] Apache Sling Feature Flags ........................ SUCCESS [7.306s]
[INFO] Apache Sling javax.activation bundle .............. SUCCESS [3.958s]
[INFO] Apache Sling Service User Mapper .................. SUCCESS [7.372s]
[INFO] Apache Sling Settings ............................. SUCCESS [3.783s]
[INFO] Apache Sling Web Console Branding ................. SUCCESS [14.434s]
[INFO] Apache Sling Web Console Security Provider ........ SUCCESS [14.452s]
[INFO] Apache Sling Explorer ............................. SUCCESS [3.454s]
[INFO] Apache Sling Health Check Core .................... SUCCESS [9.576s]
[INFO] Apache Sling Health Check Annotations ............. SUCCESS [1.581s]
[INFO] Apache Sling Health Check Samples ................. SUCCESS [5.497s]
[INFO] Apache Sling Health Check Support Components ...... SUCCESS [4.801s]
[INFO] Apache Sling Health Check Webconsole Plugin ....... SUCCESS [2.884s]
[INFO] Apache Sling Health Check JUnit Bridge ............ SUCCESS [11.083s]
[INFO] Apache Sling Health Check Integration Tests ....... SUCCESS [30.902s]
[INFO] Apache Sling Health Check Reactor POM ............. SUCCESS [1.115s]
[INFO] Apache Sling Resource Access Security ............. SUCCESS [3.414s]
[INFO] Apache Sling Test Tools ........................... SUCCESS [6.001s]
[INFO] Apache Sling Resource Access Security Integration Tests  SUCCESS [50.962s]
[INFO] Apache Sling Validation Framework API ............. SUCCESS [3.990s]
[INFO] Apache Sling Validation Framework Core Implementation  SUCCESS [5.909s]
[INFO] Apache Sling Validation Framework Testing Services  SUCCESS [3.358s]
[INFO] Apache Sling Validation Framework Integration Tests  SUCCESS [20.033s]
[INFO] Apache Sling Validation Framework Examples ........ SUCCESS [4.105s]
[INFO] Apache Sling Validation Framework Builder ......... SUCCESS [1.120s]
[INFO] Apache Sling Models API ........................... FAILURE [0.400s]
[INFO] Apache Sling Models Implementation ................ SKIPPED
[INFO] Apache Sling Models Validation Implementation ..... SKIPPED
[INFO] Apache Sling Models Integration Tests ............. SKIPPED
[INFO] Apache Sling Internationalization Support ......... SKIPPED
[INFO] Apache Sling XSS Protection Bundle ................ SKIPPED
[INFO] Apache Sling Resource Builder ..................... SKIPPED
[INFO] Apache Sling Servlet Helpers ...................... SKIPPED
[INFO] Apache Sling Testing Hamcrest ..................... SKIPPED
[INFO] Apache Sling JUnit Core ........................... SKIPPED
[INFO] Apache Sling JUnit Scriptable Tests Provider ...... SKIPPED
[INFO] Apache Sling JUnit Health Checks .................. SKIPPED
[INFO] Apache Sling JUnit Remote Tests Runners ........... SKIPPED
[INFO] Apache Sling JUnit Performance .................... SKIPPED
[INFO] Apache Sling JUnit Tests Teleporter ............... SKIPPED
[INFO] Apache Sling Testing Mock Log Configuration ....... SKIPPED
[INFO] Apache Sling Testing Resource Resolver Mock ....... SKIPPED
[INFO] Apache Sling Testing JCR Mock ..................... SKIPPED
[INFO] Apache Sling Testing OSGi Mock .................... SKIPPED
[INFO] Apache Sling Testing Sling Mock ................... SKIPPED
[INFO] Apache Sling Testing Sling Mock Jackrabbit-based Resource Resolver  SKIPPED
[INFO] Apache Sling Sample Server-Side Tests ............. SKIPPED
[INFO] Apache Sling Failing Server-Side Tests ............ SKIPPED
[INFO] Apache Sling Sample Integration Tests ............. SKIPPED
[INFO] Apache Sling Testing - sample bundle with integration tests  SKIPPED
[INFO] Apache Sling Testing Modules Reactor .............. SKIPPED
[INFO] Apache Sling Installer ............................ SKIPPED
[INFO] Apache Sling File Installer ....................... SKIPPED
[INFO] Apache Sling JCR Installer ........................ SKIPPED
[INFO] Apache Sling Installer Configuration Admin Support  SKIPPED
[INFO] Apache Sling Deployment Package Installer ......... SKIPPED
[INFO] Apache Sling Subsystems Installer ................. SKIPPED
[INFO] Apache Sling Installer Integration Tests .......... SKIPPED
[INFO] Apache Sling Launchpad API ........................ SKIPPED
[INFO] Apache Sling Launchpad Base ....................... SKIPPED
[INFO] Apache Sling Launchpad Installer .................. SKIPPED
[INFO] Apache Sling Launchpad Content .................... SKIPPED
[INFO] Apache Sling Launchpad Application Builder ........ SKIPPED
[INFO] Apache Sling Launchpad Testing Services ........... SKIPPED
[INFO] Apache Sling Launchpad Testing Services WAR ....... SKIPPED
[INFO] Apache Sling Launchpad Testing Fragment Bundle .... SKIPPED
[INFO] Apache Sling Launchpad Test Bundles ............... SKIPPED
[INFO] Apache Sling Integration Tests .................... SKIPPED
[INFO] Apache Sling Launchpad Testing .................... SKIPPED
[INFO] Apache Sling (Builder) ............................ SKIPPED
[INFO] ------------------------------------------------------------------------
[INFO] BUILD FAILURE
[INFO] ------------------------------------------------------------------------
[INFO] Total time: 1:30:23.339s
[INFO] Finished at: Sat Jan 23 11:13:55 UTC 2016
[INFO] Final Memory: 201M/460M
[INFO] ------------------------------------------------------------------------
[JENKINS] Archiving disabled
[JENKINS] Archiving disabled
[JENKINS] Archiving disabled
[JENKINS] Archiving disabled
[JENKINS] Archiving disabled
[JENKINS] Archiving disabled
[JENKINS] Archiving disabled
[JENKINS] Archiving disabled
[JENKINS] Archiving disabled
[JENKINS] Archiving disabled
[JENKINS] Archiving disabled
[JENKINS] Archiving disabled
[JENKINS] Archiving disabled
[JENKINS] Archiving disabled
[JENKINS] Archiving disabled
[JENKINS] Archiving disabled
[JENKINS] Archiving disabled
[JENKINS] Archiving disabled
[JENKINS] Archiving disabled
[JENKINS] Archiving disabled
[JENKINS] Archiving disabled
[JENKINS] Archiving disabled
[JENKINS] Archiving disabled
[JENKINS] Archiving disabled
[JENKINS] Archiving disabled
[JENKINS] Archiving disabled
[JENKINS] Archiving disabled
[JENKINS] Archiving disabled
[JENKINS] Archiving disabled
[JENKINS] Archiving disabled
[JENKINS] Archiving disabled
[JENKINS] Archiving disabled
[JENKINS] Archiving disabled
[JENKINS] Archiving disabled
[JENKINS] Archiving disabled
[JENKINS] Archiving disabled
[JENKINS] Archiving disabled
[JENKINS] Archiving disabled
[JENKINS] Archiving disabled
[JENKINS] Archiving disabled
[JENKINS] Archiving disabled
[JENKINS] Archiving disabled
[JENKINS] Archiving disabled
[JENKINS] Archiving disabled
[JENKINS] Archiving disabled
[JENKINS] Archiving disabled
[JENKINS] Archiving disabled
[JENKINS] Archiving disabled
[JENKINS] Archiving disabled
[JENKINS] Archiving disabled
[JENKINS] Archiving disabled
[JENKINS] Archiving disabled
[JENKINS] Archiving disabled
[JENKINS] Archiving disabled
[JENKINS] Archiving disabled
[JENKINS] Archiving disabled
[JENKINS] Archiving disabled
[JENKINS] Archiving disabled
[JENKINS] Archiving disabled
[JENKINS] Archiving disabled
[JENKINS] Archiving disabled
[JENKINS] Archiving disabled
[JENKINS] Archiving disabled
[JENKINS] Archiving disabled
[JENKINS] Archiving disabled
[JENKINS] Archiving disabled
[JENKINS] Archiving disabled
[JENKINS] Archiving disabled
[JENKINS] Archiving disabled
[JENKINS] Archiving disabled
[JENKINS] Archiving disabled
[JENKINS] Archiving disabled
[JENKINS] Archiving disabled
[JENKINS] Archiving disabled
[JENKINS] Archiving disabled
[JENKINS] Archiving disabled
[JENKINS] Archiving disabled
[JENKINS] Archiving disabled
[JENKINS] Archiving disabled
[JENKINS] Archiving disabled
[JENKINS] Archiving disabled
[JENKINS] Archiving disabled
[JENKINS] Archiving disabled
[JENKINS] Archiving disabled
[JENKINS] Archiving disabled
[JENKINS] Archiving disabled
[JENKINS] Archiving disabled
[JENKINS] Archiving disabled
[JENKINS] Archiving disabled
[JENKINS] Archiving disabled
[JENKINS] Archiving disabled
[JENKINS] Archiving disabled
[JENKINS] Archiving disabled
[JENKINS] Archiving disabled
[JENKINS] Archiving disabled
[JENKINS] Archiving disabled
[JENKINS] Archiving disabled
[JENKINS] Archiving disabled
[JENKINS] Archiving disabled
[JENKINS] Archiving disabled
[JENKINS] Archiving disabled
[JENKINS] Archiving disabled
[JENKINS] Archiving disabled
[JENKINS] Archiving disabled
[JENKINS] Archiving disabled
[JENKINS] Archiving disabled
[JENKINS] Archiving disabled
[JENKINS] Archiving disabled
[JENKINS] Archiving disabled
[JENKINS] Archiving disabled
[JENKINS] Archiving disabled
[JENKINS] Archiving disabled
[JENKINS] Archiving disabled
[JENKINS] Archiving disabled
[JENKINS] Archiving disabled
[JENKINS] Archiving disabled
[JENKINS] Archiving disabled
[JENKINS] Archiving disabled
[JENKINS] Archiving disabled
[JENKINS] Archiving disabled
[JENKINS] Archiving disabled
[JENKINS] Archiving disabled
[JENKINS] Archiving disabled
[JENKINS] Archiving disabled
[JENKINS] Archiving disabled
[JENKINS] Archiving disabled
[JENKINS] Archiving disabled
[JENKINS] Archiving disabled
[JENKINS] Archiving disabled
[JENKINS] Archiving disabled
[JENKINS] Archiving disabled
[JENKINS] Archiving disabled
[JENKINS] Archiving disabled
[JENKINS] Archiving disabled
[JENKINS] Archiving disabled
[JENKINS] Archiving disabled
[JENKINS] Archiving disabled
[JENKINS] Archiving disabled
[JENKINS] Archiving disabled
[JENKINS] Archiving disabled
[JENKINS] Archiving disabled
[JENKINS] Archiving disabled
[JENKINS] Archiving disabled
[JENKINS] Archiving disabled
[JENKINS] Archiving disabled
[JENKINS] Archiving disabled
[JENKINS] Archiving disabled
[JENKINS] Archiving disabled
Waiting for Jenkins to finish collecting data
[ERROR] Failed to execute goal org.apache.maven.plugins:maven-compiler-plugin:3.2:compile
(default-compile) on project org.apache.sling.models.api: Compilation failure: Compilation
failure:
[ERROR] <https://builds.apache.org/job/sling-trunk-1.8/ws/trunk/bundles/extensions/models/api/src/main/java/org/apache/sling/models/spi/injectorspecific/package-info.java>:[18,1]
annotation type not applicable to this kind of declaration
[ERROR] <https://builds.apache.org/job/sling-trunk-1.8/ws/trunk/bundles/extensions/models/api/src/main/java/org/apache/sling/models/annotations/injectorspecific/package-info.java>:[18,1]
annotation type not applicable to this kind of declaration
[ERROR] <https://builds.apache.org/job/sling-trunk-1.8/ws/trunk/bundles/extensions/models/api/src/main/java/org/apache/sling/models/spi/package-info.java>:[18,1]
annotation type not applicable to this kind of declaration
[ERROR] <https://builds.apache.org/job/sling-trunk-1.8/ws/trunk/bundles/extensions/models/api/src/main/java/org/apache/sling/models/annotations/package-info.java>:[18,1]
annotation type not applicable to this kind of declaration
[ERROR] <https://builds.apache.org/job/sling-trunk-1.8/ws/trunk/bundles/extensions/models/api/src/main/java/org/apache/sling/models/factory/package-info.java>:[18,1]
annotation type not applicable to this kind of declaration
[ERROR] -> [Help 1]
[ERROR] 
[ERROR] To see the full stack trace of the errors, re-run Maven with the -e switch.
[ERROR] Re-run Maven using the -X switch to enable full debug logging.
[ERROR] 
[ERROR] For more information about the errors and possible solutions, please read the following
articles:
[ERROR] [Help 1] http://cwiki.apache.org/confluence/display/MAVEN/MojoFailureException
[ERROR] 
[ERROR] After correcting the problems, you can resume the build with the command
[ERROR]   mvn <goals> -rf :org.apache.sling.models.api
channel stopped

Mime
View raw message