sling-commits mailing list archives

Site index · List index
Message view « Date » · « Thread »
Top « Date » · « Thread »
From Apache Jenkins Server <jenk...@builds.apache.org>
Subject Build failed in Jenkins: sling-trunk-1.7 #2944
Date Thu, 17 Dec 2015 18:47:53 GMT
See <https://builds.apache.org/job/sling-trunk-1.7/2944/>

------------------------------------------
[...truncated 310 lines...]
	at org.tmatesoft.svn.core.internal.wc2.ng.SvnNgAbstractUpdate.update(SvnNgAbstractUpdate.java:67)
	at org.tmatesoft.svn.core.internal.wc2.ng.SvnNgUpdate.run(SvnNgUpdate.java:38)
	at org.tmatesoft.svn.core.internal.wc2.ng.SvnNgUpdate.run(SvnNgUpdate.java:18)
	at org.tmatesoft.svn.core.internal.wc2.ng.SvnNgOperationRunner.run(SvnNgOperationRunner.java:20)
	at org.tmatesoft.svn.core.internal.wc2.SvnOperationRunner.run(SvnOperationRunner.java:21)
	at org.tmatesoft.svn.core.wc2.SvnOperationFactory.run(SvnOperationFactory.java:1259)
	at org.tmatesoft.svn.core.wc2.SvnOperation.run(SvnOperation.java:294)
	at org.tmatesoft.svn.core.wc.SVNUpdateClient.doUpdate(SVNUpdateClient.java:311)
	at org.tmatesoft.svn.core.wc.SVNUpdateClient.doUpdate(SVNUpdateClient.java:291)
	at org.tmatesoft.svn.core.wc.SVNUpdateClient.doUpdate(SVNUpdateClient.java:387)
	at hudson.scm.subversion.UpdateUpdater$TaskImpl.perform(UpdateUpdater.java:158)
	at hudson.scm.subversion.WorkspaceUpdater$UpdateTask.delegateTo(WorkspaceUpdater.java:162)
	at hudson.scm.SubversionSCM$CheckOutTask.perform(SubversionSCM.java:992)
	at hudson.scm.SubversionSCM$CheckOutTask.invoke(SubversionSCM.java:973)
	at hudson.scm.SubversionSCM$CheckOutTask.invoke(SubversionSCM.java:949)
	at hudson.FilePath$FileCallableWrapper.call(FilePath.java:2688)
	at hudson.remoting.UserRequest.perform(UserRequest.java:121)
	at hudson.remoting.UserRequest.perform(UserRequest.java:49)
	at hudson.remoting.Request$2.run(Request.java:326)
	at hudson.remoting.InterceptingExecutorService$1.call(InterceptingExecutorService.java:68)
	at java.util.concurrent.FutureTask.run(FutureTask.java:262)
	at java.util.concurrent.ThreadPoolExecutor.runWorker(ThreadPoolExecutor.java:1145)
	at java.util.concurrent.ThreadPoolExecutor$Worker.run(ThreadPoolExecutor.java:615)
	at java.lang.Thread.run(Thread.java:745)
Caused by: org.tmatesoft.sqljet.core.SqlJetException: FULL: error code is FULL
	at org.tmatesoft.sqljet.core.internal.pager.SqlJetPager.openJournal(SqlJetPager.java:3051)
	at org.tmatesoft.sqljet.core.internal.pager.SqlJetPager.begin(SqlJetPager.java:2782)
	at org.tmatesoft.sqljet.core.internal.btree.SqlJetBtree.beginTrans(SqlJetBtree.java:931)
	at org.tmatesoft.sqljet.core.table.engine.SqlJetEngine.doBeginTransaction(SqlJetEngine.java:561)
	at org.tmatesoft.sqljet.core.table.engine.SqlJetEngine.access$100(SqlJetEngine.java:55)
	at org.tmatesoft.sqljet.core.table.engine.SqlJetEngine$9.runSynchronized(SqlJetEngine.java:475)
	at org.tmatesoft.sqljet.core.table.engine.SqlJetEngine.runSynchronized(SqlJetEngine.java:217)
	at org.tmatesoft.sqljet.core.table.engine.SqlJetEngine.beginTransaction(SqlJetEngine.java:471)
	at org.tmatesoft.svn.core.internal.db.SVNSqlJetDb.beginTransaction(SVNSqlJetDb.java:204)
	... 28 more
ERROR: Subversion update failed
java.io.IOException: remote file operation failed: <https://builds.apache.org/job/sling-trunk-1.7/ws/>
at hudson.remoting.Channel@4beff46a:ubuntu-1: java.io.IOException
	at hudson.FilePath.act(FilePath.java:985)
	at hudson.FilePath.act(FilePath.java:967)
	at hudson.scm.SubversionSCM.checkout(SubversionSCM.java:898)
	at hudson.scm.SubversionSCM.checkout(SubversionSCM.java:834)
	at hudson.scm.SCM.checkout(SCM.java:484)
	at hudson.model.AbstractProject.checkout(AbstractProject.java:1274)
	at hudson.model.AbstractBuild$AbstractBuildExecution.defaultCheckout(AbstractBuild.java:609)
	at jenkins.scm.SCMCheckoutStrategy.checkout(SCMCheckoutStrategy.java:86)
	at hudson.model.AbstractBuild$AbstractBuildExecution.run(AbstractBuild.java:531)
	at hudson.model.Run.execute(Run.java:1738)
	at hudson.maven.MavenModuleSetBuild.run(MavenModuleSetBuild.java:531)
	at hudson.model.ResourceController.execute(ResourceController.java:98)
	at hudson.model.Executor.run(Executor.java:381)
Caused by: java.io.IOException
	at hudson.scm.subversion.UpdateUpdater$TaskImpl.perform(UpdateUpdater.java:212)
	at hudson.scm.subversion.WorkspaceUpdater$UpdateTask.delegateTo(WorkspaceUpdater.java:162)
	at hudson.scm.SubversionSCM$CheckOutTask.perform(SubversionSCM.java:992)
	at hudson.scm.SubversionSCM$CheckOutTask.invoke(SubversionSCM.java:973)
	at hudson.scm.SubversionSCM$CheckOutTask.invoke(SubversionSCM.java:949)
	at hudson.FilePath$FileCallableWrapper.call(FilePath.java:2688)
	at hudson.remoting.UserRequest.perform(UserRequest.java:121)
	at hudson.remoting.UserRequest.perform(UserRequest.java:49)
	at hudson.remoting.Request$2.run(Request.java:326)
	at hudson.remoting.InterceptingExecutorService$1.call(InterceptingExecutorService.java:68)
	at java.util.concurrent.FutureTask.run(FutureTask.java:262)
	at java.util.concurrent.ThreadPoolExecutor.runWorker(ThreadPoolExecutor.java:1145)
	at java.util.concurrent.ThreadPoolExecutor$Worker.run(ThreadPoolExecutor.java:615)
	at java.lang.Thread.run(Thread.java:745)
	at ......remote call to ubuntu-1(Native Method)
	at hudson.remoting.Channel.attachCallSiteStackTrace(Channel.java:1413)
	at hudson.remoting.UserResponse.retrieve(UserRequest.java:221)
	at hudson.remoting.Channel.call(Channel.java:778)
	at hudson.FilePath.act(FilePath.java:978)
	... 12 more
Caused by: hudson.scm.subversion.UpdaterException: failed to perform svn update
	at hudson.scm.subversion.UpdateUpdater$TaskImpl.perform(UpdateUpdater.java:212)
	at hudson.scm.subversion.WorkspaceUpdater$UpdateTask.delegateTo(WorkspaceUpdater.java:162)
	at hudson.scm.SubversionSCM$CheckOutTask.perform(SubversionSCM.java:992)
	at hudson.scm.SubversionSCM$CheckOutTask.invoke(SubversionSCM.java:973)
	at hudson.scm.SubversionSCM$CheckOutTask.invoke(SubversionSCM.java:949)
	at hudson.FilePath$FileCallableWrapper.call(FilePath.java:2688)
	at hudson.remoting.UserRequest.perform(UserRequest.java:121)
	at hudson.remoting.UserRequest.perform(UserRequest.java:49)
	at hudson.remoting.Request$2.run(Request.java:326)
	at hudson.remoting.InterceptingExecutorService$1.call(InterceptingExecutorService.java:68)
	at java.util.concurrent.FutureTask.run(FutureTask.java:262)
	at java.util.concurrent.ThreadPoolExecutor.runWorker(ThreadPoolExecutor.java:1145)
	at java.util.concurrent.ThreadPoolExecutor$Worker.run(ThreadPoolExecutor.java:615)
	at java.lang.Thread.run(Thread.java:745)
Caused by: org.tmatesoft.svn.core.SVNException: svn: E200030: FULL
	at org.tmatesoft.svn.core.internal.wc.SVNErrorManager.error(SVNErrorManager.java:64)
	at org.tmatesoft.svn.core.internal.wc.SVNErrorManager.error(SVNErrorManager.java:51)
	at org.tmatesoft.svn.core.internal.db.SVNSqlJetDb.createSqlJetError(SVNSqlJetDb.java:193)
	at org.tmatesoft.svn.core.internal.db.SVNSqlJetDb.beginTransaction(SVNSqlJetDb.java:209)
	at org.tmatesoft.svn.core.internal.db.SVNSqlJetDb.runTransaction(SVNSqlJetDb.java:255)
	at org.tmatesoft.svn.core.internal.db.SVNSqlJetDb.runTransaction(SVNSqlJetDb.java:250)
	at org.tmatesoft.svn.core.internal.wc17.db.SVNWCDb.obtainWCLock(SVNWCDb.java:5631)
	at org.tmatesoft.svn.core.internal.wc17.SVNWCContext.acquireWriteLock(SVNWCContext.java:1627)
	at org.tmatesoft.svn.core.internal.wc2.ng.SvnNgAbstractUpdate.update(SvnNgAbstractUpdate.java:67)
	at org.tmatesoft.svn.core.internal.wc2.ng.SvnNgUpdate.run(SvnNgUpdate.java:38)
	at org.tmatesoft.svn.core.internal.wc2.ng.SvnNgUpdate.run(SvnNgUpdate.java:18)
	at org.tmatesoft.svn.core.internal.wc2.ng.SvnNgOperationRunner.run(SvnNgOperationRunner.java:20)
	at org.tmatesoft.svn.core.internal.wc2.SvnOperationRunner.run(SvnOperationRunner.java:21)
	at org.tmatesoft.svn.core.wc2.SvnOperationFactory.run(SvnOperationFactory.java:1259)
	at org.tmatesoft.svn.core.wc2.SvnOperation.run(SvnOperation.java:294)
	at org.tmatesoft.svn.core.wc.SVNUpdateClient.doUpdate(SVNUpdateClient.java:311)
	at org.tmatesoft.svn.core.wc.SVNUpdateClient.doUpdate(SVNUpdateClient.java:291)
	at org.tmatesoft.svn.core.wc.SVNUpdateClient.doUpdate(SVNUpdateClient.java:387)
	at hudson.scm.subversion.UpdateUpdater$TaskImpl.perform(UpdateUpdater.java:158)
	... 13 more
Caused by: org.tmatesoft.sqljet.core.SqlJetException: FULL: error code is FULL
	at org.tmatesoft.sqljet.core.internal.pager.SqlJetPager.openJournal(SqlJetPager.java:3051)
	at org.tmatesoft.sqljet.core.internal.pager.SqlJetPager.begin(SqlJetPager.java:2782)
	at org.tmatesoft.sqljet.core.internal.btree.SqlJetBtree.beginTrans(SqlJetBtree.java:931)
	at org.tmatesoft.sqljet.core.table.engine.SqlJetEngine.doBeginTransaction(SqlJetEngine.java:561)
	at org.tmatesoft.sqljet.core.table.engine.SqlJetEngine.access$100(SqlJetEngine.java:55)
	at org.tmatesoft.sqljet.core.table.engine.SqlJetEngine$9.runSynchronized(SqlJetEngine.java:475)
	at org.tmatesoft.sqljet.core.table.engine.SqlJetEngine.runSynchronized(SqlJetEngine.java:217)
	at org.tmatesoft.sqljet.core.table.engine.SqlJetEngine.beginTransaction(SqlJetEngine.java:471)
	at org.tmatesoft.svn.core.internal.db.SVNSqlJetDb.beginTransaction(SVNSqlJetDb.java:204)
	... 28 more
Retrying after 10 seconds
Cleaning up <https://builds.apache.org/job/sling-trunk-1.7/ws/trunk>
Updating http://svn.apache.org/repos/asf/sling/trunk at revision '2015-12-17T18:47:00.875
+0000'
ERROR: Failed to update http://svn.apache.org/repos/asf/sling/trunk
org.tmatesoft.svn.core.SVNException: svn: E200030: FULL
	at org.tmatesoft.svn.core.internal.wc.SVNErrorManager.error(SVNErrorManager.java:64)
	at org.tmatesoft.svn.core.internal.wc.SVNErrorManager.error(SVNErrorManager.java:51)
	at org.tmatesoft.svn.core.internal.db.SVNSqlJetDb.createSqlJetError(SVNSqlJetDb.java:193)
	at org.tmatesoft.svn.core.internal.db.SVNSqlJetDb.beginTransaction(SVNSqlJetDb.java:209)
	at org.tmatesoft.svn.core.internal.db.SVNSqlJetDb.runTransaction(SVNSqlJetDb.java:255)
	at org.tmatesoft.svn.core.internal.db.SVNSqlJetDb.runTransaction(SVNSqlJetDb.java:250)
	at org.tmatesoft.svn.core.internal.wc17.db.SVNWCDb.obtainWCLock(SVNWCDb.java:5631)
	at org.tmatesoft.svn.core.internal.wc17.SVNWCContext.acquireWriteLock(SVNWCContext.java:1627)
	at org.tmatesoft.svn.core.internal.wc2.ng.SvnNgAbstractUpdate.update(SvnNgAbstractUpdate.java:67)
	at org.tmatesoft.svn.core.internal.wc2.ng.SvnNgUpdate.run(SvnNgUpdate.java:38)
	at org.tmatesoft.svn.core.internal.wc2.ng.SvnNgUpdate.run(SvnNgUpdate.java:18)
	at org.tmatesoft.svn.core.internal.wc2.ng.SvnNgOperationRunner.run(SvnNgOperationRunner.java:20)
	at org.tmatesoft.svn.core.internal.wc2.SvnOperationRunner.run(SvnOperationRunner.java:21)
	at org.tmatesoft.svn.core.wc2.SvnOperationFactory.run(SvnOperationFactory.java:1259)
	at org.tmatesoft.svn.core.wc2.SvnOperation.run(SvnOperation.java:294)
	at org.tmatesoft.svn.core.wc.SVNUpdateClient.doUpdate(SVNUpdateClient.java:311)
	at org.tmatesoft.svn.core.wc.SVNUpdateClient.doUpdate(SVNUpdateClient.java:291)
	at org.tmatesoft.svn.core.wc.SVNUpdateClient.doUpdate(SVNUpdateClient.java:387)
	at hudson.scm.subversion.UpdateUpdater$TaskImpl.perform(UpdateUpdater.java:158)
	at hudson.scm.subversion.WorkspaceUpdater$UpdateTask.delegateTo(WorkspaceUpdater.java:162)
	at hudson.scm.SubversionSCM$CheckOutTask.perform(SubversionSCM.java:992)
	at hudson.scm.SubversionSCM$CheckOutTask.invoke(SubversionSCM.java:973)
	at hudson.scm.SubversionSCM$CheckOutTask.invoke(SubversionSCM.java:949)
	at hudson.FilePath$FileCallableWrapper.call(FilePath.java:2688)
	at hudson.remoting.UserRequest.perform(UserRequest.java:121)
	at hudson.remoting.UserRequest.perform(UserRequest.java:49)
	at hudson.remoting.Request$2.run(Request.java:326)
	at hudson.remoting.InterceptingExecutorService$1.call(InterceptingExecutorService.java:68)
	at java.util.concurrent.FutureTask.run(FutureTask.java:262)
	at java.util.concurrent.ThreadPoolExecutor.runWorker(ThreadPoolExecutor.java:1145)
	at java.util.concurrent.ThreadPoolExecutor$Worker.run(ThreadPoolExecutor.java:615)
	at java.lang.Thread.run(Thread.java:745)
Caused by: org.tmatesoft.sqljet.core.SqlJetException: FULL: error code is FULL
	at org.tmatesoft.sqljet.core.internal.pager.SqlJetPager.openJournal(SqlJetPager.java:3051)
	at org.tmatesoft.sqljet.core.internal.pager.SqlJetPager.begin(SqlJetPager.java:2782)
	at org.tmatesoft.sqljet.core.internal.btree.SqlJetBtree.beginTrans(SqlJetBtree.java:931)
	at org.tmatesoft.sqljet.core.table.engine.SqlJetEngine.doBeginTransaction(SqlJetEngine.java:561)
	at org.tmatesoft.sqljet.core.table.engine.SqlJetEngine.access$100(SqlJetEngine.java:55)
	at org.tmatesoft.sqljet.core.table.engine.SqlJetEngine$9.runSynchronized(SqlJetEngine.java:475)
	at org.tmatesoft.sqljet.core.table.engine.SqlJetEngine.runSynchronized(SqlJetEngine.java:217)
	at org.tmatesoft.sqljet.core.table.engine.SqlJetEngine.beginTransaction(SqlJetEngine.java:471)
	at org.tmatesoft.svn.core.internal.db.SVNSqlJetDb.beginTransaction(SVNSqlJetDb.java:204)
	... 28 more
ERROR: Subversion update failed
java.io.IOException: remote file operation failed: <https://builds.apache.org/job/sling-trunk-1.7/ws/>
at hudson.remoting.Channel@4beff46a:ubuntu-1: java.io.IOException
	at hudson.FilePath.act(FilePath.java:985)
	at hudson.FilePath.act(FilePath.java:967)
	at hudson.scm.SubversionSCM.checkout(SubversionSCM.java:898)
	at hudson.scm.SubversionSCM.checkout(SubversionSCM.java:834)
	at hudson.scm.SCM.checkout(SCM.java:484)
	at hudson.model.AbstractProject.checkout(AbstractProject.java:1274)
	at hudson.model.AbstractBuild$AbstractBuildExecution.defaultCheckout(AbstractBuild.java:609)
	at jenkins.scm.SCMCheckoutStrategy.checkout(SCMCheckoutStrategy.java:86)
	at hudson.model.AbstractBuild$AbstractBuildExecution.run(AbstractBuild.java:531)
	at hudson.model.Run.execute(Run.java:1738)
	at hudson.maven.MavenModuleSetBuild.run(MavenModuleSetBuild.java:531)
	at hudson.model.ResourceController.execute(ResourceController.java:98)
	at hudson.model.Executor.run(Executor.java:381)
Caused by: java.io.IOException
	at hudson.scm.subversion.UpdateUpdater$TaskImpl.perform(UpdateUpdater.java:212)
	at hudson.scm.subversion.WorkspaceUpdater$UpdateTask.delegateTo(WorkspaceUpdater.java:162)
	at hudson.scm.SubversionSCM$CheckOutTask.perform(SubversionSCM.java:992)
	at hudson.scm.SubversionSCM$CheckOutTask.invoke(SubversionSCM.java:973)
	at hudson.scm.SubversionSCM$CheckOutTask.invoke(SubversionSCM.java:949)
	at hudson.FilePath$FileCallableWrapper.call(FilePath.java:2688)
	at hudson.remoting.UserRequest.perform(UserRequest.java:121)
	at hudson.remoting.UserRequest.perform(UserRequest.java:49)
	at hudson.remoting.Request$2.run(Request.java:326)
	at hudson.remoting.InterceptingExecutorService$1.call(InterceptingExecutorService.java:68)
	at java.util.concurrent.FutureTask.run(FutureTask.java:262)
	at java.util.concurrent.ThreadPoolExecutor.runWorker(ThreadPoolExecutor.java:1145)
	at java.util.concurrent.ThreadPoolExecutor$Worker.run(ThreadPoolExecutor.java:615)
	at java.lang.Thread.run(Thread.java:745)
	at ......remote call to ubuntu-1(Native Method)
	at hudson.remoting.Channel.attachCallSiteStackTrace(Channel.java:1413)
	at hudson.remoting.UserResponse.retrieve(UserRequest.java:221)
	at hudson.remoting.Channel.call(Channel.java:778)
	at hudson.FilePath.act(FilePath.java:978)
	... 12 more
Caused by: hudson.scm.subversion.UpdaterException: failed to perform svn update
	at hudson.scm.subversion.UpdateUpdater$TaskImpl.perform(UpdateUpdater.java:212)
	at hudson.scm.subversion.WorkspaceUpdater$UpdateTask.delegateTo(WorkspaceUpdater.java:162)
	at hudson.scm.SubversionSCM$CheckOutTask.perform(SubversionSCM.java:992)
	at hudson.scm.SubversionSCM$CheckOutTask.invoke(SubversionSCM.java:973)
	at hudson.scm.SubversionSCM$CheckOutTask.invoke(SubversionSCM.java:949)
	at hudson.FilePath$FileCallableWrapper.call(FilePath.java:2688)
	at hudson.remoting.UserRequest.perform(UserRequest.java:121)
	at hudson.remoting.UserRequest.perform(UserRequest.java:49)
	at hudson.remoting.Request$2.run(Request.java:326)
	at hudson.remoting.InterceptingExecutorService$1.call(InterceptingExecutorService.java:68)
	at java.util.concurrent.FutureTask.run(FutureTask.java:262)
	at java.util.concurrent.ThreadPoolExecutor.runWorker(ThreadPoolExecutor.java:1145)
	at java.util.concurrent.ThreadPoolExecutor$Worker.run(ThreadPoolExecutor.java:615)
	at java.lang.Thread.run(Thread.java:745)
Caused by: org.tmatesoft.svn.core.SVNException: svn: E200030: FULL
	at org.tmatesoft.svn.core.internal.wc.SVNErrorManager.error(SVNErrorManager.java:64)
	at org.tmatesoft.svn.core.internal.wc.SVNErrorManager.error(SVNErrorManager.java:51)
	at org.tmatesoft.svn.core.internal.db.SVNSqlJetDb.createSqlJetError(SVNSqlJetDb.java:193)
	at org.tmatesoft.svn.core.internal.db.SVNSqlJetDb.beginTransaction(SVNSqlJetDb.java:209)
	at org.tmatesoft.svn.core.internal.db.SVNSqlJetDb.runTransaction(SVNSqlJetDb.java:255)
	at org.tmatesoft.svn.core.internal.db.SVNSqlJetDb.runTransaction(SVNSqlJetDb.java:250)
	at org.tmatesoft.svn.core.internal.wc17.db.SVNWCDb.obtainWCLock(SVNWCDb.java:5631)
	at org.tmatesoft.svn.core.internal.wc17.SVNWCContext.acquireWriteLock(SVNWCContext.java:1627)
	at org.tmatesoft.svn.core.internal.wc2.ng.SvnNgAbstractUpdate.update(SvnNgAbstractUpdate.java:67)
	at org.tmatesoft.svn.core.internal.wc2.ng.SvnNgUpdate.run(SvnNgUpdate.java:38)
	at org.tmatesoft.svn.core.internal.wc2.ng.SvnNgUpdate.run(SvnNgUpdate.java:18)
	at org.tmatesoft.svn.core.internal.wc2.ng.SvnNgOperationRunner.run(SvnNgOperationRunner.java:20)
	at org.tmatesoft.svn.core.internal.wc2.SvnOperationRunner.run(SvnOperationRunner.java:21)
	at org.tmatesoft.svn.core.wc2.SvnOperationFactory.run(SvnOperationFactory.java:1259)
	at org.tmatesoft.svn.core.wc2.SvnOperation.run(SvnOperation.java:294)
	at org.tmatesoft.svn.core.wc.SVNUpdateClient.doUpdate(SVNUpdateClient.java:311)
	at org.tmatesoft.svn.core.wc.SVNUpdateClient.doUpdate(SVNUpdateClient.java:291)
	at org.tmatesoft.svn.core.wc.SVNUpdateClient.doUpdate(SVNUpdateClient.java:387)
	at hudson.scm.subversion.UpdateUpdater$TaskImpl.perform(UpdateUpdater.java:158)
	... 13 more
Caused by: org.tmatesoft.sqljet.core.SqlJetException: FULL: error code is FULL
	at org.tmatesoft.sqljet.core.internal.pager.SqlJetPager.openJournal(SqlJetPager.java:3051)
	at org.tmatesoft.sqljet.core.internal.pager.SqlJetPager.begin(SqlJetPager.java:2782)
	at org.tmatesoft.sqljet.core.internal.btree.SqlJetBtree.beginTrans(SqlJetBtree.java:931)
	at org.tmatesoft.sqljet.core.table.engine.SqlJetEngine.doBeginTransaction(SqlJetEngine.java:561)
	at org.tmatesoft.sqljet.core.table.engine.SqlJetEngine.access$100(SqlJetEngine.java:55)
	at org.tmatesoft.sqljet.core.table.engine.SqlJetEngine$9.runSynchronized(SqlJetEngine.java:475)
	at org.tmatesoft.sqljet.core.table.engine.SqlJetEngine.runSynchronized(SqlJetEngine.java:217)
	at org.tmatesoft.sqljet.core.table.engine.SqlJetEngine.beginTransaction(SqlJetEngine.java:471)
	at org.tmatesoft.svn.core.internal.db.SVNSqlJetDb.beginTransaction(SVNSqlJetDb.java:204)
	... 28 more

Mime
View raw message