sling-commits mailing list archives

Site index · List index
Message view « Date » · « Thread »
Top « Date » · « Thread »
From Apache Jenkins Server <jenk...@builds.apache.org>
Subject Build failed in Jenkins: sling-contrib-1.7 #667
Date Mon, 21 Dec 2015 15:28:50 GMT
See <https://builds.apache.org/job/sling-contrib-1.7/667/changes>

Changes:

[bdelacretaz] SLING-5355 - factor our TestUtil

------------------------------------------
[...truncated 5874 lines...]
[INFO] 
[INFO] --- maven-antrun-plugin:1.7:run (set-bundle-required-execution-environment) @ org.apache.sling.hapi.samplecontent
---
[INFO] Executing tasks

main:
Setting Bundle-RequiredExecutionEnvironment=JavaSE-1.6 from sling.java.version=6
[INFO] Executed tasks
[WARNING] Failed to getClass for org.apache.maven.plugin.source.SourceJarMojo
[INFO] 
[INFO] --- maven-source-plugin:2.2.1:jar (attach-sources) @ org.apache.sling.hapi.samplecontent
---
[INFO] Building jar: <https://builds.apache.org/job/sling-contrib-1.7/ws/trunk/extensions/hapi/samplecontent/target/org.apache.sling.hapi.samplecontent-1.0.0-SNAPSHOT-sources.jar>
[INFO] 
[INFO] --- maven-site-plugin:3.3:attach-descriptor (attach-descriptor) @ org.apache.sling.hapi.samplecontent
---
[INFO] 
[INFO] --- ianal-maven-plugin:1.0-alpha-1:verify-legal-files (default) @ org.apache.sling.hapi.samplecontent
---
[INFO] Checking legal files in: org.apache.sling.hapi.samplecontent-1.0.0-SNAPSHOT.jar
[INFO] Checking legal files in: org.apache.sling.hapi.samplecontent-1.0.0-SNAPSHOT-sources.jar
[INFO] 
[INFO] --- maven-install-plugin:2.5.1:install (default-install) @ org.apache.sling.hapi.samplecontent
---
[INFO] Installing <https://builds.apache.org/job/sling-contrib-1.7/ws/trunk/extensions/hapi/samplecontent/target/org.apache.sling.hapi.samplecontent-1.0.0-SNAPSHOT.jar>
to /home/jenkins/jenkins-slave/maven-repositories/0/org/apache/sling/org.apache.sling.hapi.samplecontent/1.0.0-SNAPSHOT/org.apache.sling.hapi.samplecontent-1.0.0-SNAPSHOT.jar
[INFO] Installing <https://builds.apache.org/job/sling-contrib-1.7/ws/trunk/extensions/hapi/samplecontent/pom.xml>
to /home/jenkins/jenkins-slave/maven-repositories/0/org/apache/sling/org.apache.sling.hapi.samplecontent/1.0.0-SNAPSHOT/org.apache.sling.hapi.samplecontent-1.0.0-SNAPSHOT.pom
[INFO] Installing <https://builds.apache.org/job/sling-contrib-1.7/ws/trunk/extensions/hapi/samplecontent/target/org.apache.sling.hapi.samplecontent-1.0.0-SNAPSHOT-sources.jar>
to /home/jenkins/jenkins-slave/maven-repositories/0/org/apache/sling/org.apache.sling.hapi.samplecontent/1.0.0-SNAPSHOT/org.apache.sling.hapi.samplecontent-1.0.0-SNAPSHOT-sources.jar
[INFO] 
[INFO] --- maven-bundle-plugin:2.4.0:install (default-install) @ org.apache.sling.hapi.samplecontent
---
[INFO] Local OBR update disabled (enable with -DobrRepository)
[JENKINS] Archiving disabled
[INFO]                                                                         
[INFO] ------------------------------------------------------------------------
[INFO] Building HApi - Sling Hypermedia API Tools Reactor 1.0.0-SNAPSHOT
[INFO] ------------------------------------------------------------------------
[INFO] 
[INFO] --- maven-clean-plugin:2.5:clean (default-clean) @ org.apache.sling.hapi.reactor ---
[INFO] 
[INFO] --- maven-enforcer-plugin:1.3.1:enforce (enforce-java) @ org.apache.sling.hapi.reactor
---
[INFO] 
[INFO] --- maven-antrun-plugin:1.7:run (set-bundle-required-execution-environment) @ org.apache.sling.hapi.reactor
---
[INFO] Executing tasks

main:
[INFO] Executed tasks
[INFO] 
[INFO] --- maven-remote-resources-plugin:1.5:process (default) @ org.apache.sling.hapi.reactor
---
[INFO] 
[INFO] --- maven-antrun-plugin:1.7:run (check-memory-task) @ org.apache.sling.hapi.reactor
---
[INFO] Executing tasks

main:
     [echo] **************** WARNING (SLING-443/SLING-1782) ******************************
     [echo] On most platforms, you'll get OutOfMemoryErrors when building unless you set
     [echo] on 32bit platforms: MAVEN_OPTS="-Xmx256M -XX:MaxPermSize=256M", see SLING-443
     [echo] on 64bit platforms: MAVEN_OPTS="-Xmx512M -XX:MaxPermSize=512M", see SLING-1782
     [echo] ******************************************************************************
[INFO] Executed tasks
[INFO] 
[INFO] --- animal-sniffer-maven-plugin:1.11:check (default) @ org.apache.sling.hapi.reactor
---
[INFO] Checking unresolved references to org.codehaus.mojo.signature:java15:1.0
[INFO] 
[INFO] --- maven-enforcer-plugin:1.3.1:enforce (enforce-java) @ org.apache.sling.hapi.reactor
---
[INFO] 
[INFO] --- maven-antrun-plugin:1.7:run (set-bundle-required-execution-environment) @ org.apache.sling.hapi.reactor
---
[INFO] Executing tasks

main:
[INFO] Executed tasks
[WARNING] Failed to getClass for org.apache.maven.plugin.source.SourceJarMojo
[INFO] 
[INFO] --- maven-source-plugin:2.2.1:jar (attach-sources) @ org.apache.sling.hapi.reactor
---
[INFO] 
[INFO] --- maven-site-plugin:3.3:attach-descriptor (attach-descriptor) @ org.apache.sling.hapi.reactor
---
[INFO] 
[INFO] --- ianal-maven-plugin:1.0-alpha-1:verify-legal-files (default) @ org.apache.sling.hapi.reactor
---
[INFO] 
[INFO] --- maven-install-plugin:2.5.1:install (default-install) @ org.apache.sling.hapi.reactor
---
[INFO] Installing <https://builds.apache.org/job/sling-contrib-1.7/ws/trunk/extensions/hapi/pom.xml>
to /home/jenkins/jenkins-slave/maven-repositories/0/org/apache/sling/org.apache.sling.hapi.reactor/1.0.0-SNAPSHOT/org.apache.sling.hapi.reactor-1.0.0-SNAPSHOT.pom
[JENKINS] Archiving disabled
[INFO]                                                                         
[INFO] ------------------------------------------------------------------------
[INFO] Building Apache Sling ACL Definitions Parser 0.0.1-SNAPSHOT
[INFO] ------------------------------------------------------------------------
Downloading: http://repo.maven.apache.org/maven2/commons-io/commons-io/2.5/commons-io-2.5.pom
[WARNING] The POM for commons-io:commons-io:jar:2.5 is missing, no dependency information
available
Downloading: http://repo.maven.apache.org/maven2/commons-io/commons-io/2.5/commons-io-2.5.jar
[JENKINS] Archiving disabled
[INFO] ------------------------------------------------------------------------
[INFO] Reactor Summary:
[INFO] 
[INFO] Apache Sling OpenID Authentication ................ SUCCESS [18.520s]
[INFO] Apache Sling Authentication XING API .............. SUCCESS [2.663s]
[INFO] Apache Sling Authentication XING Login ............ SUCCESS [4.119s]
[INFO] Apache Sling Authentication XING OAuth ............ SUCCESS [4.237s]
[INFO] Apache Sling Authentication Selector .............. SUCCESS [2.357s]
[INFO] Apache Sling Commons HTML Utilities ............... SUCCESS [2.122s]
[INFO] Apache Sling APT parser ........................... SUCCESS [3.291s]
[INFO] Apache Sling APT servlet .......................... SUCCESS [2.014s]
[INFO] Apache Sling Resource Collection API .............. SUCCESS [2.652s]
[INFO] Apache Sling DataSource Provider .................. SUCCESS [8.404s]
[INFO] Apache Sling Dojo JavaScript Library .............. SUCCESS [7.965s]
[INFO] Apache Sling Dojo Data Extension .................. SUCCESS [2.107s]
[INFO] Apache Sling FTP Server ........................... SUCCESS [3.049s]
[INFO] Apache Sling Google Web Toolkit Servlet Library ... SUCCESS [3.620s]
[INFO] Apache Sling Google Web Toolkit Sample ............ SUCCESS [31.836s]
[INFO] Apache Sling JMX Resource Provider ................ SUCCESS [2.236s]
[INFO] Apache Sling ClassLoader Leak Detector ............ SUCCESS [2.087s]
[INFO] Apache Sling MongoDB Resource Provider ............ SUCCESS [1.981s]
[INFO] Apache Sling OSGi Bundle Repository ............... SUCCESS [3.116s]
[INFO] Apache Sling Distribution API ..................... SUCCESS [1.954s]
[INFO] Apache Sling Distribution Core .................... SUCCESS [8.504s]
[INFO] Apache Sling Distribution Extensions .............. SUCCESS [6.271s]
[INFO] Apache Sling Distribution Sample .................. SUCCESS [1.983s]
[INFO] Apache Sling Distribution Integration Tests ....... SUCCESS [5:33.804s]
[INFO] Apache Sling Log Tail Implementation .............. SUCCESS [4.201s]
[INFO] S3 dependencies for Oak ........................... SUCCESS [3.860s]
[INFO] Apache Sling Request Processing Analyzer .......... SUCCESS [2.153s]
[INFO] Apache Sling Resource Merger ...................... SUCCESS [2.946s]
[INFO] Apache Sling Inventory Printer Based on Resources . SUCCESS [1.925s]
[INFO] Apache Sling Rewriter ............................. SUCCESS [4.462s]
[INFO] Apache Sling Security ............................. SUCCESS [3.379s]
[INFO] Apache Sling SLF4J MDC Filter ..................... SUCCESS [8.387s]
[INFO] Apache Sling Query ................................ SUCCESS [4.734s]
[INFO] Apache Sling Superimposing Resource Provider ...... SUCCESS [3.307s]
[INFO] Apache Sling Tenant ............................... SUCCESS [2.525s]
[INFO] Apache Sling URL Rewriter ......................... SUCCESS [1.946s]
[INFO] HApi - Sling Hypermedia API tools ................. SUCCESS [3.916s]
[INFO] HApi - Sample Content ............................. SUCCESS [1.795s]
[INFO] HApi - Sling Hypermedia API Tools Reactor ......... SUCCESS [2.009s]
[INFO] Apache Sling ACL Definitions Parser ............... FAILURE [0.477s]
[INFO] Apache Sling ACL Definitions Oak/JCR module ....... SKIPPED
[INFO] Apache Sling ACL Definitions Reactor .............. SKIPPED
[INFO] Apache Sling JCR Java Compiler .................... SKIPPED
[INFO] Apache Sling Repository Accessor .................. SKIPPED
[INFO] Apache Sling Object Content Mapping ............... SKIPPED
[INFO] Apache Sling JCR Prefs ............................ SKIPPED
[INFO] Apache Sling JCR Resource Security ................ SKIPPED
[INFO] Apache Sling Script Console ....................... SKIPPED
[INFO] Apache Sling Atom Tag Library ..................... SKIPPED
[INFO] Apache Sling Scripting Freemarker Support ......... SKIPPED
[INFO] Apache Sling Scripting Groovy Support ............. SKIPPED
[INFO] Apache Sling Scripting Java Support ............... SKIPPED
[INFO] Apache Sling Scripting JST Support ................ SKIPPED
[INFO] Apache Sling Scripting Python Support ............. SKIPPED
[INFO] Apache Sling Scripting Ruby Support ............... SKIPPED
[INFO] Scala Script Engine ............................... SKIPPED
[INFO] Apache Sling Scala Scripting Configuration ........ SKIPPED
[INFO] Scala for Sling Demo Application - Hello World .... SKIPPED
[INFO] Scala for Sling Demo Application - Forum .......... SKIPPED
[INFO] Apache Sling Scripting Thymeleaf .................. SKIPPED
[INFO] Apache Sling Scripting Velocity Support ........... SKIPPED
[INFO] Apache Sling Scripting W3C XML Processing Support . SKIPPED
[INFO] Apache Sling NoSQL Generic Resource Provider ...... SKIPPED
[INFO] Apache Sling NoSQL Couchbase Client ............... SKIPPED
[INFO] Apache Sling NoSQL Couchbase Resource Provider .... SKIPPED
[INFO] Apache Sling NoSQL MongoDB Resource Provider ...... SKIPPED
[INFO] Apache Sling Launchpad Contrib Testing ............ SKIPPED
[INFO] Apache Sling Launchpad Karaf - Features ........... SKIPPED
[INFO] Apache Sling Launchpad Karaf - Distribution ....... SKIPPED
[INFO] Apache Sling Launchpad Karaf - Integration Tests .. SKIPPED
[INFO] Apache Sling Launchpad Karaf Builder .............. SKIPPED
[INFO] Apache Sling Contrib (Builder) .................... SKIPPED
[INFO] ------------------------------------------------------------------------
[INFO] BUILD FAILURE
[INFO] ------------------------------------------------------------------------
[INFO] Total time: 8:52.443s
[INFO] Finished at: Mon Dec 21 15:28:36 UTC 2015
[INFO] Final Memory: 127M/491M
[INFO] ------------------------------------------------------------------------
[JENKINS] Archiving disabled
[JENKINS] Archiving disabled
[JENKINS] Archiving disabled
[JENKINS] Archiving disabled
[JENKINS] Archiving disabled
[JENKINS] Archiving disabled
[JENKINS] Archiving disabled
[JENKINS] Archiving disabled
[JENKINS] Archiving disabled
[JENKINS] Archiving disabled
[JENKINS] Archiving disabled
[JENKINS] Archiving disabled
[JENKINS] Archiving disabled
[JENKINS] Archiving disabled
[JENKINS] Archiving disabled
[JENKINS] Archiving disabled
[JENKINS] Archiving disabled
[JENKINS] Archiving disabled
[JENKINS] Archiving disabled
[JENKINS] Archiving disabled
[JENKINS] Archiving disabled
[JENKINS] Archiving disabled
[JENKINS] Archiving disabled
[JENKINS] Archiving disabled
[JENKINS] Archiving disabled
[JENKINS] Archiving disabled
[JENKINS] Archiving disabled
[JENKINS] Archiving disabled
[JENKINS] Archiving disabled
[JENKINS] Archiving disabled
[JENKINS] Archiving disabled
[JENKINS] Archiving disabled
[JENKINS] Archiving disabled
[JENKINS] Archiving disabled
[JENKINS] Archiving disabled
[JENKINS] Archiving disabled
[JENKINS] Archiving disabled
[JENKINS] Archiving disabled
[JENKINS] Archiving disabled
[JENKINS] Archiving disabled
[JENKINS] Archiving disabled
[JENKINS] Archiving disabled
[JENKINS] Archiving disabled
[JENKINS] Archiving disabled
[JENKINS] Archiving disabled
[JENKINS] Archiving disabled
[JENKINS] Archiving disabled
[JENKINS] Archiving disabled
[JENKINS] Archiving disabled
[JENKINS] Archiving disabled
[JENKINS] Archiving disabled
[JENKINS] Archiving disabled
[JENKINS] Archiving disabled
[JENKINS] Archiving disabled
[JENKINS] Archiving disabled
[JENKINS] Archiving disabled
[JENKINS] Archiving disabled
[JENKINS] Archiving disabled
[JENKINS] Archiving disabled
[JENKINS] Archiving disabled
[JENKINS] Archiving disabled
[JENKINS] Archiving disabled
[JENKINS] Archiving disabled
[JENKINS] Archiving disabled
[JENKINS] Archiving disabled
[JENKINS] Archiving disabled
[JENKINS] Archiving disabled
[JENKINS] Archiving disabled
[JENKINS] Archiving disabled
[JENKINS] Archiving disabled
[JENKINS] Archiving disabled
[JENKINS] Archiving disabled
Waiting for Jenkins to finish collecting data
[ERROR] Failed to execute goal on project org.apache.sling.acldef.parser: Could not resolve
dependencies for project org.apache.sling:org.apache.sling.acldef.parser:bundle:0.0.1-SNAPSHOT:
Could not find artifact commons-io:commons-io:jar:2.5 in central (http://repo.maven.apache.org/maven2)
-> [Help 1]
[ERROR] 
[ERROR] To see the full stack trace of the errors, re-run Maven with the -e switch.
[ERROR] Re-run Maven using the -X switch to enable full debug logging.
[ERROR] 
[ERROR] For more information about the errors and possible solutions, please read the following
articles:
[ERROR] [Help 1] http://cwiki.apache.org/confluence/display/MAVEN/DependencyResolutionException
[ERROR] 
[ERROR] After correcting the problems, you can resume the build with the command
[ERROR]   mvn <goals> -rf :org.apache.sling.acldef.parser
channel stopped

Mime
View raw message