sling-commits mailing list archives

Site index · List index
Message view « Date » · « Thread »
Top « Date » · « Thread »
From Apache Jenkins Server <jenk...@builds.apache.org>
Subject Build failed in Jenkins: sling-trunk-1.8 #2220
Date Wed, 16 Dec 2015 01:08:34 GMT
See <https://builds.apache.org/job/sling-trunk-1.8/2220/changes>

Changes:

[olli] SLING-5378 Use version of Groovy in GSPScriptEngineFactory for language version

[olli] SLING-5377 Update Groovy to 2.4.5

* remove optional groovy-xml from Karaf feature

------------------------------------------
[...truncated 13100 lines...]
A         testing/mocks/jcr-mock/src/main/java/org/apache/sling/testing/mock
A         testing/mocks/jcr-mock/src/main/java/org/apache/sling/testing/mock/jcr
AU        testing/mocks/jcr-mock/src/main/java/org/apache/sling/testing/mock/jcr/MockJcr.java
AU        testing/mocks/jcr-mock/src/main/java/org/apache/sling/testing/mock/jcr/ItemData.java
AU        testing/mocks/jcr-mock/src/main/java/org/apache/sling/testing/mock/jcr/MockRepository.java
AU        testing/mocks/jcr-mock/src/main/java/org/apache/sling/testing/mock/jcr/MockNodeTypeManager.java
AU        testing/mocks/jcr-mock/src/main/java/org/apache/sling/testing/mock/jcr/MockSession.java
AU        testing/mocks/jcr-mock/src/main/java/org/apache/sling/testing/mock/jcr/MockProperty.java
AU        testing/mocks/jcr-mock/src/main/java/org/apache/sling/testing/mock/jcr/MockNamespaceRegistry.java
AU        testing/mocks/jcr-mock/src/main/java/org/apache/sling/testing/mock/jcr/MockNode.java
AU        testing/mocks/jcr-mock/src/main/java/org/apache/sling/testing/mock/jcr/MockObservationManager.java
AU        testing/mocks/jcr-mock/src/main/java/org/apache/sling/testing/mock/jcr/MockNodeType.java
AU        testing/mocks/jcr-mock/src/main/java/org/apache/sling/testing/mock/jcr/ItemFilter.java
AU        testing/mocks/jcr-mock/src/main/java/org/apache/sling/testing/mock/jcr/MockWorkspace.java
AU        testing/mocks/jcr-mock/src/main/java/org/apache/sling/testing/mock/jcr/MockQueryManager.java
AU        testing/mocks/jcr-mock/src/main/java/org/apache/sling/testing/mock/jcr/MockQueryResultHandler.java
AU        testing/mocks/jcr-mock/src/main/java/org/apache/sling/testing/mock/jcr/MockQueryResult.java
AU        testing/mocks/jcr-mock/src/main/java/org/apache/sling/testing/mock/jcr/MockQuery.java
AU        testing/mocks/jcr-mock/src/main/java/org/apache/sling/testing/mock/jcr/MockRow.java
AU        testing/mocks/jcr-mock/src/main/java/org/apache/sling/testing/mock/jcr/AbstractItem.java
AU        testing/mocks/jcr-mock/src/main/java/org/apache/sling/testing/mock/jcr/package-info.java
AU        testing/mocks/jcr-mock/src/main/java/org/apache/sling/testing/mock/jcr/MockNodeTypes.java
AU        testing/mocks/jcr-mock/src/main/java/org/apache/sling/testing/mock/jcr/ResourceUtil.java
A         testing/mocks/osgi-mock
A         testing/mocks/osgi-mock/src
A         testing/mocks/osgi-mock/src/test
A         testing/mocks/osgi-mock/src/test/resources
A         testing/mocks/osgi-mock/src/test/resources/META-INF
AU        testing/mocks/osgi-mock/src/test/resources/META-INF/test.txt
A         testing/mocks/osgi-mock/src/test/resources/bundleData
A         testing/mocks/osgi-mock/src/test/resources/bundleData/nested
A         testing/mocks/osgi-mock/src/test/resources/bundleData/nested/first.txt
A         testing/mocks/osgi-mock/src/test/resources/bundleData/nested/second.txt
AU        testing/mocks/osgi-mock/src/test/resources/simplelogger.properties
A         testing/mocks/osgi-mock/src/test/resources/OSGI-INF
AU        testing/mocks/osgi-mock/src/test/resources/OSGI-INF/org.apache.sling.testing.mock.osgi.OsgiServiceUtilActivateDeactivateTest.xml
AU        testing/mocks/osgi-mock/src/test/resources/OSGI-INF/org.apache.sling.testing.mock.osgi.OsgiServiceUtilTest.xml
AU        testing/mocks/osgi-mock/src/test/resources/OSGI-INF/serviceComponents.xml
A         testing/mocks/osgi-mock/src/test/java
A         testing/mocks/osgi-mock/src/test/java/org
A         testing/mocks/osgi-mock/src/test/java/org/apache
A         testing/mocks/osgi-mock/src/test/java/org/apache/sling
A         testing/mocks/osgi-mock/src/test/java/org/apache/sling/testing
A         testing/mocks/osgi-mock/src/test/java/org/apache/sling/testing/mock
A         testing/mocks/osgi-mock/src/test/java/org/apache/sling/testing/mock/osgi
AU        testing/mocks/osgi-mock/src/test/java/org/apache/sling/testing/mock/osgi/MockBundleContextTest.java
AU        testing/mocks/osgi-mock/src/test/java/org/apache/sling/testing/mock/osgi/MockServiceReferenceTest.java
A         testing/mocks/osgi-mock/src/test/java/org/apache/sling/testing/mock/osgi/junit
AU        testing/mocks/osgi-mock/src/test/java/org/apache/sling/testing/mock/osgi/junit/OsgiContextTest.java
AU        testing/mocks/osgi-mock/src/test/java/org/apache/sling/testing/mock/osgi/MockBundleContextDynamicReferncesTest.java
AU        testing/mocks/osgi-mock/src/test/java/org/apache/sling/testing/mock/osgi/MockConfigurationAdminTest.java
AU        testing/mocks/osgi-mock/src/test/java/org/apache/sling/testing/mock/osgi/OsgiServiceUtilActivateDeactivateTest.java
AU        testing/mocks/osgi-mock/src/test/java/org/apache/sling/testing/mock/osgi/MockLogServiceTest.java
AU        testing/mocks/osgi-mock/src/test/java/org/apache/sling/testing/mock/osgi/OsgiMetadataUtilTest.java
AU        testing/mocks/osgi-mock/src/test/java/org/apache/sling/testing/mock/osgi/OsgiServiceUtilTest.java
AU        testing/mocks/osgi-mock/src/test/java/org/apache/sling/testing/mock/osgi/MockComponentContextTest.java
AU        testing/mocks/osgi-mock/src/test/java/org/apache/sling/testing/mock/osgi/MockBundleTest.java
AU        testing/mocks/osgi-mock/src/test/java/org/apache/sling/testing/mock/osgi/MockBundleContextDynamicReferncesOsgiR6Test.java
AU        testing/mocks/osgi-mock/src/test/java/org/apache/sling/testing/mock/osgi/MockEventAdminTest.java
A         testing/mocks/osgi-mock/src/test/java/org/apache/sling/testing/mock/osgi/context
AU        testing/mocks/osgi-mock/src/test/java/org/apache/sling/testing/mock/osgi/context/OsgiContextImplTest.java
A         testing/mocks/osgi-mock/src/main
A         testing/mocks/osgi-mock/src/main/java
A         testing/mocks/osgi-mock/src/main/java/org
A         testing/mocks/osgi-mock/src/main/java/org/apache
A         testing/mocks/osgi-mock/src/main/java/org/apache/sling
A         testing/mocks/osgi-mock/src/main/java/org/apache/sling/testing
A         testing/mocks/osgi-mock/src/main/java/org/apache/sling/testing/mock
A         testing/mocks/osgi-mock/src/main/java/org/apache/sling/testing/mock/osgi
AU        testing/mocks/osgi-mock/src/main/java/org/apache/sling/testing/mock/osgi/OsgiMetadataUtil.java
AU        testing/mocks/osgi-mock/src/main/java/org/apache/sling/testing/mock/osgi/ReferenceViolationException.java
A         testing/mocks/osgi-mock/src/main/java/org/apache/sling/testing/mock/osgi/context
AU        testing/mocks/osgi-mock/src/main/java/org/apache/sling/testing/mock/osgi/context/package-info.java
AU        testing/mocks/osgi-mock/src/main/java/org/apache/sling/testing/mock/osgi/context/OsgiContextImpl.java
AU        testing/mocks/osgi-mock/src/main/java/org/apache/sling/testing/mock/osgi/MockEventAdmin.java
AU        testing/mocks/osgi-mock/src/main/java/org/apache/sling/testing/mock/osgi/NoScrMetadataException.java
AU        testing/mocks/osgi-mock/src/main/java/org/apache/sling/testing/mock/osgi/MockServiceRegistration.java
A         testing/mocks/osgi-mock/src/main/java/org/apache/sling/testing/mock/osgi/junit
AU        testing/mocks/osgi-mock/src/main/java/org/apache/sling/testing/mock/osgi/junit/OsgiContext.java
AU        testing/mocks/osgi-mock/src/main/java/org/apache/sling/testing/mock/osgi/junit/OsgiContextCallback.java
AU        testing/mocks/osgi-mock/src/main/java/org/apache/sling/testing/mock/osgi/junit/package-info.java
AU        testing/mocks/osgi-mock/src/main/java/org/apache/sling/testing/mock/osgi/MapUtil.java
AU        testing/mocks/osgi-mock/src/main/java/org/apache/sling/testing/mock/osgi/MockOsgi.java
AU        testing/mocks/osgi-mock/src/main/java/org/apache/sling/testing/mock/osgi/MockLogService.java
AU        testing/mocks/osgi-mock/src/main/java/org/apache/sling/testing/mock/osgi/ComponentContextBuilder.java
AU        testing/mocks/osgi-mock/src/main/java/org/apache/sling/testing/mock/osgi/OsgiServiceUtil.java
AU        testing/mocks/osgi-mock/src/main/java/org/apache/sling/testing/mock/osgi/MockComponentContext.java
AU        testing/mocks/osgi-mock/src/main/java/org/apache/sling/testing/mock/osgi/MockConfiguration.java
AU        testing/mocks/osgi-mock/src/main/java/org/apache/sling/testing/mock/osgi/MockBundle.java
AU        testing/mocks/osgi-mock/src/main/java/org/apache/sling/testing/mock/osgi/package-info.java
AU        testing/mocks/osgi-mock/src/main/java/org/apache/sling/testing/mock/osgi/MockBundleContext.java
AU        testing/mocks/osgi-mock/src/main/java/org/apache/sling/testing/mock/osgi/MockServiceReference.java
AU        testing/mocks/osgi-mock/src/main/java/org/apache/sling/testing/mock/osgi/MockConfigurationAdmin.java
AU        testing/mocks/osgi-mock/src/main/java/org/apache/sling/testing/mock/osgi/MatchAllFilter.java
AU        testing/mocks/osgi-mock/pom.xml
AU        testing/mocks/osgi-mock/README.txt
A         testing/sling-pax-util
A         testing/sling-pax-util/src
A         testing/sling-pax-util/src/main
A         testing/sling-pax-util/src/main/java
A         testing/sling-pax-util/src/main/java/org
A         testing/sling-pax-util/src/main/java/org/apache
A         testing/sling-pax-util/src/main/java/org/apache/sling
A         testing/sling-pax-util/src/main/java/org/apache/sling/paxexam
A         testing/sling-pax-util/src/main/java/org/apache/sling/paxexam/util
A         testing/sling-pax-util/src/main/java/org/apache/sling/paxexam/util/SlingPaxOptions.java
A         testing/sling-pax-util/src/test
A         testing/sling-pax-util/src/test/java
A         testing/sling-pax-util/src/test/java/org
A         testing/sling-pax-util/src/test/java/org/apache
A         testing/sling-pax-util/src/test/java/org/apache/sling
A         testing/sling-pax-util/src/test/java/org/apache/sling/paxexam
A         testing/sling-pax-util/src/test/java/org/apache/sling/paxexam/util
A         testing/sling-pax-util/src/test/java/org/apache/sling/paxexam/util/IgnoredBundlesTest.java
AU        testing/sling-pax-util/src/test/java/org/apache/sling/paxexam/util/SlingRepositoryTest.java
A         testing/sling-pax-util/src/test/java/org/apache/sling/paxexam/util/SlingSetupTest.java
A         testing/sling-pax-util/pom.xml
A         testing/sling-pax-util/.gitignore
A         testing/tools
A         testing/tools/src
A         testing/tools/src/main
A         testing/tools/src/main/java
A         testing/tools/src/main/java/org
A         testing/tools/src/main/java/org/apache
A         testing/tools/src/main/java/org/apache/sling
A         testing/tools/src/main/java/org/apache/sling/testing
A         testing/tools/src/main/java/org/apache/sling/testing/tools
A         testing/tools/src/main/java/org/apache/sling/testing/tools/jarexec
AU        testing/tools/src/main/java/org/apache/sling/testing/tools/jarexec/package-info.java
AU        testing/tools/src/main/java/org/apache/sling/testing/tools/jarexec/JarExecutor.java
AU        testing/tools/src/main/java/org/apache/sling/testing/tools/jarexec/ShutdownHookSingleProcessDestroyer.java
A         testing/tools/src/main/java/org/apache/sling/testing/tools/osgi
AU        testing/tools/src/main/java/org/apache/sling/testing/tools/osgi/WebconsoleClient.java
AU        testing/tools/src/main/java/org/apache/sling/testing/tools/osgi/package-info.java
A         testing/tools/src/main/java/org/apache/sling/testing/tools/retry
AU        testing/tools/src/main/java/org/apache/sling/testing/tools/retry/RetryLoop.java
AU        testing/tools/src/main/java/org/apache/sling/testing/tools/retry/package-info.java
A         testing/tools/src/main/java/org/apache/sling/testing/tools/serversetup
AU        testing/tools/src/main/java/org/apache/sling/testing/tools/serversetup/SetupPhase.java
AU        testing/tools/src/main/java/org/apache/sling/testing/tools/serversetup/StartRunnableJarPhase.java
AU        testing/tools/src/main/java/org/apache/sling/testing/tools/serversetup/package-info.java
AU        testing/tools/src/main/java/org/apache/sling/testing/tools/serversetup/ServerSetup.java
AU        testing/tools/src/main/java/org/apache/sling/testing/tools/serversetup/ServerSetupSingleton.java
A         testing/tools/src/main/java/org/apache/sling/testing/tools/junit
A         testing/tools/src/main/java/org/apache/sling/testing/tools/junit/TestDescriptionRule.java
A         testing/tools/src/main/java/org/apache/sling/testing/tools/junit/TestNameLoggingFilter.java
A         testing/tools/src/main/java/org/apache/sling/testing/tools/junit/TestDescriptionInterceptor.java
AU        testing/tools/src/main/java/org/apache/sling/testing/tools/junit/package-info.java
AU        testing/tools/src/main/java/org/apache/sling/testing/tools/junit/RemoteLogDumper.java
A         testing/tools/src/main/java/org/apache/sling/testing/tools/sling
AU        testing/tools/src/main/java/org/apache/sling/testing/tools/sling/BundlesInstaller.java
AU        testing/tools/src/main/java/org/apache/sling/testing/tools/sling/SlingClient.java
A         testing/tools/src/main/java/org/apache/sling/testing/tools/sling/SlingInstanceManager.java
A         testing/tools/src/main/java/org/apache/sling/testing/tools/sling/SlingInstancesRule.java
A         testing/tools/src/main/java/org/apache/sling/testing/tools/sling/SlingInstance.java
A         testing/tools/src/main/java/org/apache/sling/testing/tools/sling/SlingInstanceState.java
AU        testing/tools/src/main/java/org/apache/sling/testing/tools/sling/TimeoutsProvider.java
AU        testing/tools/src/main/java/org/apache/sling/testing/tools/sling/package-info.java
AU        testing/tools/src/main/java/org/apache/sling/testing/tools/sling/SlingTestBase.java
A         testing/tools/src/main/java/org/apache/sling/testing/tools/http
AU        testing/tools/src/main/java/org/apache/sling/testing/tools/http/RetryingContentChecker.java
AU        testing/tools/src/main/java/org/apache/sling/testing/tools/http/package-info.java
AU        testing/tools/src/main/java/org/apache/sling/testing/tools/http/RequestExecutor.java
AU        testing/tools/src/main/java/org/apache/sling/testing/tools/http/Request.java
AU        testing/tools/src/main/java/org/apache/sling/testing/tools/http/RequestDocumentor.java
AU        testing/tools/src/main/java/org/apache/sling/testing/tools/http/RequestCustomizer.java
AU        testing/tools/src/main/java/org/apache/sling/testing/tools/http/RequestBuilder.java
A         testing/tools/src/test
A         testing/tools/src/test/java
A         testing/tools/src/test/java/org
A         testing/tools/src/test/java/org/apache
A         testing/tools/src/test/java/org/apache/sling
A         testing/tools/src/test/java/org/apache/sling/testing
A         testing/tools/src/test/java/org/apache/sling/testing/tools
A         testing/tools/src/test/java/org/apache/sling/testing/tools/sling
A         testing/tools/src/test/java/org/apache/sling/testing/tools/sling/SlingInstancesRuleTest.java
AU        testing/tools/src/test/java/org/apache/sling/testing/tools/sling/SlingClientTest.java
A         testing/tools/src/test/java/org/apache/sling/testing/tools/test
AU        testing/tools/src/test/java/org/apache/sling/testing/tools/test/TestServerSetup.java
AU        testing/tools/src/test/java/org/apache/sling/testing/tools/test/ServerSetupSingletonTest.java
AU        testing/tools/src/test/java/org/apache/sling/testing/tools/test/TestSetupPhase.java
AU        testing/tools/pom.xml
AU        check_staged_release.sh
A         .mvn
A         .mvn/jvm.config
AU        NOTICE
AU        LICENSE
AU        check_release_matches_tag.sh
A         .travis.yml
A         src
A         src/main
A         src/main/javadoc
AU        src/main/javadoc/overview.html
A         src/misc
AU        src/misc/README.txt
A         src/misc/sling-6-source-release.javadoc.patch
 U        .
At revision 1720288
Parsing POMs
ERROR: Failed to parse POMs
java.io.IOException: remote file operation failed: <https://builds.apache.org/job/sling-trunk-1.8/ws/trunk>
at hudson.remoting.Channel@1a8e9dd0:jenkins-ubuntu-1404-4gb-7ef: hudson.remoting.ProxyException:
hudson.maven.MavenModuleSetBuild$MavenExecutionException: org.apache.maven.project.ProjectBuildingException:
Some problems were encountered while processing the POMs:
[FATAL] Non-resolvable parent POM: Could not find artifact org.apache.sling:sling:pom:26-SNAPSHOT
and 'parent.relativePath' points at no local POM @ line 23, column 13

	at hudson.FilePath.act(FilePath.java:985)
	at hudson.FilePath.act(FilePath.java:967)
	at hudson.maven.MavenModuleSetBuild$MavenModuleSetBuildExecution.parsePoms(MavenModuleSetBuild.java:960)
	at hudson.maven.MavenModuleSetBuild$MavenModuleSetBuildExecution.doRun(MavenModuleSetBuild.java:679)
	at hudson.model.AbstractBuild$AbstractBuildExecution.run(AbstractBuild.java:536)
	at hudson.model.Run.execute(Run.java:1738)
	at hudson.maven.MavenModuleSetBuild.run(MavenModuleSetBuild.java:531)
	at hudson.model.ResourceController.execute(ResourceController.java:98)
	at hudson.model.Executor.run(Executor.java:381)
Caused by: hudson.remoting.ProxyException: hudson.maven.MavenModuleSetBuild$MavenExecutionException:
org.apache.maven.project.ProjectBuildingException: Some problems were encountered while processing
the POMs:
[FATAL] Non-resolvable parent POM: Could not find artifact org.apache.sling:sling:pom:26-SNAPSHOT
and 'parent.relativePath' points at no local POM @ line 23, column 13

	at hudson.maven.MavenModuleSetBuild$PomParser.invoke(MavenModuleSetBuild.java:1364)
	at hudson.maven.MavenModuleSetBuild$PomParser.invoke(MavenModuleSetBuild.java:1098)
	at hudson.FilePath$FileCallableWrapper.call(FilePath.java:2688)
	at hudson.remoting.UserRequest.perform(UserRequest.java:121)
	at hudson.remoting.UserRequest.perform(UserRequest.java:49)
	at hudson.remoting.Request$2.run(Request.java:326)
	at hudson.remoting.InterceptingExecutorService$1.call(InterceptingExecutorService.java:68)
	at java.util.concurrent.FutureTask.run(FutureTask.java:262)
	at java.util.concurrent.ThreadPoolExecutor.runWorker(ThreadPoolExecutor.java:1145)
	at java.util.concurrent.ThreadPoolExecutor$Worker.run(ThreadPoolExecutor.java:615)
	at java.lang.Thread.run(Thread.java:745)
	at ......remote call to jenkins-ubuntu-1404-4gb-7ef(Native Method)
	at hudson.remoting.Channel.attachCallSiteStackTrace(Channel.java:1413)
	at hudson.remoting.UserResponse.retrieve(UserRequest.java:221)
	at hudson.remoting.Channel.call(Channel.java:778)
	at hudson.FilePath.act(FilePath.java:978)
	... 8 more
Caused by: hudson.remoting.ProxyException: org.apache.maven.project.ProjectBuildingException:
Some problems were encountered while processing the POMs:
[FATAL] Non-resolvable parent POM: Could not find artifact org.apache.sling:sling:pom:26-SNAPSHOT
and 'parent.relativePath' points at no local POM @ line 23, column 13

	at org.apache.maven.project.DefaultProjectBuilder.build(DefaultProjectBuilder.java:364)
	at hudson.maven.MavenEmbedder.buildProjects(MavenEmbedder.java:361)
	at hudson.maven.MavenEmbedder.readProjects(MavenEmbedder.java:331)
	at hudson.maven.MavenModuleSetBuild$PomParser.invoke(MavenModuleSetBuild.java:1301)
	at hudson.maven.MavenModuleSetBuild$PomParser.invoke(MavenModuleSetBuild.java:1098)
	at hudson.FilePath$FileCallableWrapper.call(FilePath.java:2688)
	at hudson.remoting.UserRequest.perform(UserRequest.java:121)
	at hudson.remoting.UserRequest.perform(UserRequest.java:49)
	at hudson.remoting.Request$2.run(Request.java:326)
	at hudson.remoting.InterceptingExecutorService$1.call(InterceptingExecutorService.java:68)
	at java.util.concurrent.FutureTask.run(FutureTask.java:262)
	at java.util.concurrent.ThreadPoolExecutor.runWorker(ThreadPoolExecutor.java:1145)
	at java.util.concurrent.ThreadPoolExecutor$Worker.run(ThreadPoolExecutor.java:615)
	at java.lang.Thread.run(Thread.java:745)

Mime
View raw message