sling-commits mailing list archives

Site index · List index
Message view « Date » · « Thread »
Top « Date » · « Thread »
From Apache Jenkins Server <jenk...@builds.apache.org>
Subject Build failed in Jenkins: sling-trunk-1.8 #2130
Date Wed, 02 Dec 2015 20:32:29 GMT
See <https://builds.apache.org/job/sling-trunk-1.8/2130/>

------------------------------------------
[...truncated 669534 lines...]
[INFO] Apache Sling Discovery Base ....................... SUCCESS [1:27.465s]
[INFO] Apache Sling Resource-Based Discovery Service ..... SUCCESS [30:11.317s]
[INFO] Apache Sling Oak-Based Discovery Service .......... SUCCESS [12:10.146s]
[INFO] Apache Sling Discovery Support Bundle ............. SUCCESS [2.858s]
[INFO] Apache Sling Discovery Standalone Implementation .. SUCCESS [4.473s]
[INFO] Apache Sling Event Support ........................ SUCCESS [23:59.404s]
[INFO] Apache Sling Feature Flags ........................ SUCCESS [2.683s]
[INFO] Apache Sling javax.activation bundle .............. SUCCESS [2.542s]
[INFO] Apache Sling Service User Mapper .................. SUCCESS [4.047s]
[INFO] Apache Sling Settings ............................. SUCCESS [3.815s]
[INFO] Apache Sling Web Console Branding ................. SUCCESS [1.919s]
[INFO] Apache Sling Web Console Security Provider ........ SUCCESS [5.105s]
[INFO] Apache Sling Explorer ............................. SUCCESS [2.977s]
[INFO] Apache Sling Health Check Core .................... SUCCESS [13.229s]
[INFO] Apache Sling Health Check Annotations ............. SUCCESS [2.946s]
[INFO] Apache Sling Health Check Samples ................. SUCCESS [6.514s]
[INFO] Apache Sling Health Check Support Components ...... SUCCESS [5.961s]
[INFO] Apache Sling Health Check Webconsole Plugin ....... SUCCESS [3.846s]
[INFO] Apache Sling Health Check JUnit Bridge ............ SUCCESS [4.344s]
[INFO] Apache Sling Health Check Integration Tests ....... SUCCESS [30.856s]
[INFO] Apache Sling Health Check Reactor POM ............. SUCCESS [1.130s]
[INFO] Apache Sling Resource Access Security ............. SUCCESS [3.410s]
[INFO] Apache Sling Test Tools ........................... SUCCESS [7.564s]
[INFO] Apache Sling Resource Access Security Integration Tests  SUCCESS [1:37.549s]
[INFO] Apache Sling Validation Framework API ............. SUCCESS [4.009s]
[INFO] Apache Sling Validation Framework Core Implementation  SUCCESS [8.048s]
[INFO] Apache Sling Validation Framework Testing Services  SUCCESS [3.868s]
[INFO] Apache Sling Validation Framework Integration Tests  SUCCESS [1:05.567s]
[INFO] Apache Sling Validation Framework Examples ........ SUCCESS [3.793s]
[INFO] Apache Sling Validation Framework Builder ......... SUCCESS [1.152s]
[INFO] Apache Sling Models Validation Implementation ..... SUCCESS [2.310s]
[INFO] Apache Sling Models Integration Tests ............. FAILURE [1:06.202s]
[INFO] Apache Sling Internationalization Support ......... SKIPPED
[INFO] Apache Sling XSS Protection Bundle ................ SKIPPED
[INFO] Apache Sling Testing Hamcrest ..................... SKIPPED
[INFO] Apache Sling JUnit Core ........................... SKIPPED
[INFO] Apache Sling JUnit Scriptable Tests Provider ...... SKIPPED
[INFO] Apache Sling JUnit Health Checks .................. SKIPPED
[INFO] Apache Sling JUnit Remote Tests Runners ........... SKIPPED
[INFO] Apache Sling JUnit Performance .................... SKIPPED
[INFO] Apache Sling JUnit Tests Teleporter ............... SKIPPED
[INFO] Apache Sling Testing Mock Log Configuration ....... SKIPPED
[INFO] Apache Sling Testing Resource Resolver Mock ....... SKIPPED
[INFO] Apache Sling Testing JCR Mock ..................... SKIPPED
[INFO] Apache Sling Testing OSGi Mock .................... SKIPPED
[INFO] Apache Sling Testing Sling Mock ................... SKIPPED
[INFO] Apache Sling Testing Sling Mock Jackrabbit-based Resource Resolver  SKIPPED
[INFO] Apache Sling Testing Sling Mock Oak-based Resource Resolver  SKIPPED
[INFO] Apache Sling Sample Server-Side Tests ............. SKIPPED
[INFO] Apache Sling Failing Server-Side Tests ............ SKIPPED
[INFO] Apache Sling Sample Integration Tests ............. SKIPPED
[INFO] Apache Sling Testing Modules Reactor .............. SKIPPED
[INFO] Apache Sling Installer ............................ SKIPPED
[INFO] Apache Sling File Installer ....................... SKIPPED
[INFO] Apache Sling JCR Installer ........................ SKIPPED
[INFO] Apache Sling Installer Configuration Admin Support  SKIPPED
[INFO] Apache Sling Deployment Package Installer ......... SKIPPED
[INFO] Apache Sling Subsystems Installer ................. SKIPPED
[INFO] Apache Sling Installer Integration Tests .......... SKIPPED
[INFO] Apache Sling Launchpad API ........................ SKIPPED
[INFO] Apache Sling Launchpad Installer .................. SKIPPED
[INFO] Apache Sling Launchpad Content .................... SKIPPED
[INFO] Apache Sling Launchpad Application Builder ........ SKIPPED
[INFO] Apache Sling Launchpad Testing Services ........... SKIPPED
[INFO] Apache Sling Launchpad Testing Services WAR ....... SKIPPED
[INFO] Apache Sling Launchpad Testing Fragment Bundle .... SKIPPED
[INFO] Apache Sling Launchpad Test Bundles ............... SKIPPED
[INFO] Apache Sling Integration Tests .................... SKIPPED
[INFO] Apache Sling Launchpad Testing .................... SKIPPED
[INFO] Apache Sling (Builder) ............................ SKIPPED
[INFO] ------------------------------------------------------------------------
[INFO] BUILD FAILURE
[INFO] ------------------------------------------------------------------------
[INFO] Total time: 1:37:23.269s
[INFO] Finished at: Wed Dec 02 20:32:10 UTC 2015
[INFO] Final Memory: 181M/464M
[INFO] ------------------------------------------------------------------------
[JENKINS] Archiving disabled
[JENKINS] Archiving disabled
[JENKINS] Archiving disabled
[JENKINS] Archiving disabled
[JENKINS] Archiving disabled
[JENKINS] Archiving disabled
[JENKINS] Archiving disabled
[JENKINS] Archiving disabled
[JENKINS] Archiving disabled
[JENKINS] Archiving disabled
[JENKINS] Archiving disabled
[JENKINS] Archiving disabled
[JENKINS] Archiving disabled
[JENKINS] Archiving disabled
[JENKINS] Archiving disabled
[JENKINS] Archiving disabled
[JENKINS] Archiving disabled
[JENKINS] Archiving disabled
[JENKINS] Archiving disabled
[JENKINS] Archiving disabled
[JENKINS] Archiving disabled
[JENKINS] Archiving disabled
[JENKINS] Archiving disabled
[JENKINS] Archiving disabled
[JENKINS] Archiving disabled
[JENKINS] Archiving disabled
[JENKINS] Archiving disabled
[JENKINS] Archiving disabled
[JENKINS] Archiving disabled
[JENKINS] Archiving disabled
[JENKINS] Archiving disabled
[JENKINS] Archiving disabled
[JENKINS] Archiving disabled
[JENKINS] Archiving disabled
[JENKINS] Archiving disabled
[JENKINS] Archiving disabled
[JENKINS] Archiving disabled
[JENKINS] Archiving disabled
[JENKINS] Archiving disabled
[JENKINS] Archiving disabled
[JENKINS] Archiving disabled
[JENKINS] Archiving disabled
[JENKINS] Archiving disabled
[JENKINS] Archiving disabled
[JENKINS] Archiving disabled
[JENKINS] Archiving disabled
[JENKINS] Archiving disabled
[JENKINS] Archiving disabled
[JENKINS] Archiving disabled
[JENKINS] Archiving disabled
[JENKINS] Archiving disabled
[JENKINS] Archiving disabled
[JENKINS] Archiving disabled
[JENKINS] Archiving disabled
[JENKINS] Archiving disabled
[JENKINS] Archiving disabled
[JENKINS] Archiving disabled
[JENKINS] Archiving disabled
[JENKINS] Archiving disabled
[JENKINS] Archiving disabled
[JENKINS] Archiving disabled
[JENKINS] Archiving disabled
[JENKINS] Archiving disabled
[JENKINS] Archiving disabled
[JENKINS] Archiving disabled
[JENKINS] Archiving disabled
[JENKINS] Archiving disabled
[JENKINS] Archiving disabled
[JENKINS] Archiving disabled
[JENKINS] Archiving disabled
[JENKINS] Archiving disabled
[JENKINS] Archiving disabled
[JENKINS] Archiving disabled
[JENKINS] Archiving disabled
[JENKINS] Archiving disabled
[JENKINS] Archiving disabled
[JENKINS] Archiving disabled
[JENKINS] Archiving disabled
[JENKINS] Archiving disabled
[JENKINS] Archiving disabled
[JENKINS] Archiving disabled
[JENKINS] Archiving disabled
[JENKINS] Archiving disabled
[JENKINS] Archiving disabled
[JENKINS] Archiving disabled
[JENKINS] Archiving disabled
[JENKINS] Archiving disabled
[JENKINS] Archiving disabled
[JENKINS] Archiving disabled
[JENKINS] Archiving disabled
[JENKINS] Archiving disabled
[JENKINS] Archiving disabled
[JENKINS] Archiving disabled
[JENKINS] Archiving disabled
[JENKINS] Archiving disabled
[JENKINS] Archiving disabled
[JENKINS] Archiving disabled
[JENKINS] Archiving disabled
[JENKINS] Archiving disabled
[JENKINS] Archiving disabled
[JENKINS] Archiving disabled
[JENKINS] Archiving disabled
[JENKINS] Archiving disabled
[JENKINS] Archiving disabled
[JENKINS] Archiving disabled
[JENKINS] Archiving disabled
[JENKINS] Archiving disabled
[JENKINS] Archiving disabled
[JENKINS] Archiving disabled
[JENKINS] Archiving disabled
[JENKINS] Archiving disabled
[JENKINS] Archiving disabled
[JENKINS] Archiving disabled
[JENKINS] Archiving disabled
[JENKINS] Archiving disabled
[JENKINS] Archiving disabled
[JENKINS] Archiving disabled
[JENKINS] Archiving disabled
[JENKINS] Archiving disabled
[JENKINS] Archiving disabled
[JENKINS] Archiving disabled
[JENKINS] Archiving disabled
[JENKINS] Archiving disabled
[JENKINS] Archiving disabled
[JENKINS] Archiving disabled
[JENKINS] Archiving disabled
[JENKINS] Archiving disabled
[JENKINS] Archiving disabled
[JENKINS] Archiving disabled
[JENKINS] Archiving disabled
[JENKINS] Archiving disabled
[JENKINS] Archiving disabled
[JENKINS] Archiving disabled
[JENKINS] Archiving disabled
[JENKINS] Archiving disabled
[JENKINS] Archiving disabled
[JENKINS] Archiving disabled
[JENKINS] Archiving disabled
[JENKINS] Archiving disabled
[JENKINS] Archiving disabled
Waiting for Jenkins to finish collecting data
[ERROR] Failed to execute goal org.apache.maven.plugins:maven-failsafe-plugin:2.18.1:integration-test
(integration-test) on project org.apache.sling.models.integration-tests: Execution integration-test
of goal org.apache.maven.plugins:maven-failsafe-plugin:2.18.1:integration-test failed: There
was an error in the forked process
[ERROR] java.lang.AssertionError: Server not ready after 60 seconds, giving up
[ERROR] at org.junit.Assert.fail(Assert.java:88)
[ERROR] at org.apache.sling.testing.tools.sling.SlingTestBase.waitForServerReady(SlingTestBase.java:326)
[ERROR] at org.apache.sling.testing.tools.sling.SlingTestBase.startServerIfNeeded(SlingTestBase.java:169)
[ERROR] at org.apache.sling.testing.tools.sling.SlingTestBase.getServerBaseUrl(SlingTestBase.java:231)
[ERROR] at org.apache.sling.models.it.RemoteIT.getJunitServletUrl(RemoteIT.java:28)
[ERROR] at org.apache.sling.junit.remote.testrunner.SlingRemoteTestRunner.maybeExecuteTests(SlingRemoteTestRunner.java:95)
[ERROR] at org.apache.sling.junit.remote.testrunner.SlingRemoteTestRunner.getChildren(SlingRemoteTestRunner.java:138)
[ERROR] at org.junit.runners.ParentRunner.getFilteredChildren(ParentRunner.java:363)
[ERROR] at org.junit.runners.ParentRunner.getDescription(ParentRunner.java:297)
[ERROR] at org.junit.runners.Suite.describeChild(Suite.java:122)
[ERROR] at org.junit.runners.Suite.describeChild(Suite.java:26)
[ERROR] at org.junit.runners.ParentRunner.getDescription(ParentRunner.java:298)
[ERROR] at org.apache.maven.surefire.common.junit4.JUnit4ProviderUtil.createSuiteDescription(JUnit4ProviderUtil.java:113)
[ERROR] at org.apache.maven.surefire.junit4.JUnit4Provider.createTestsDescription(JUnit4Provider.java:257)
[ERROR] at org.apache.maven.surefire.junit4.JUnit4Provider.invoke(JUnit4Provider.java:124)
[ERROR] at org.apache.maven.surefire.booter.ForkedBooter.invokeProviderInSameClassLoader(ForkedBooter.java:203)
[ERROR] at org.apache.maven.surefire.booter.ForkedBooter.runSuitesInProcess(ForkedBooter.java:155)
[ERROR] at org.apache.maven.surefire.booter.ForkedBooter.main(ForkedBooter.java:103)
[ERROR] -> [Help 1]
[ERROR] 
[ERROR] To see the full stack trace of the errors, re-run Maven with the -e switch.
[ERROR] Re-run Maven using the -X switch to enable full debug logging.
[ERROR] 
[ERROR] For more information about the errors and possible solutions, please read the following
articles:
[ERROR] [Help 1] http://cwiki.apache.org/confluence/display/MAVEN/PluginExecutionException
[ERROR] 
[ERROR] After correcting the problems, you can resume the build with the command
[ERROR]   mvn <goals> -rf :org.apache.sling.models.integration-tests
channel stopped

Mime
View raw message