sling-commits mailing list archives

Site index · List index
Message view « Date » · « Thread »
Top « Date » · « Thread »
From Apache Jenkins Server <jenk...@builds.apache.org>
Subject Build failed in Jenkins: sling-contrib-1.7 #613
Date Mon, 07 Dec 2015 15:42:51 GMT
See <https://builds.apache.org/job/sling-contrib-1.7/613/changes>

Changes:

[bdelacretaz] SLING-5134 - new Sling Pipes module, donated by Nicolas Peltier, thanks!

------------------------------------------
[...truncated 8767 lines...]
[WARNING] Failed to getClass for org.apache.maven.plugin.source.SourceJarMojo
[INFO] 
[INFO] --- maven-source-plugin:2.4:jar (attach-sources) @ org.apache.sling.scripting.scala.forum
---
[INFO] Building jar: <https://builds.apache.org/job/sling-contrib-1.7/ws/trunk/scripting/scala/samples/forum/target/org.apache.sling.scripting.scala.forum-0.9.0-SNAPSHOT-sources.jar>
[INFO] 
[INFO] --- maven-site-plugin:3.4:attach-descriptor (attach-descriptor) @ org.apache.sling.scripting.scala.forum
---
[INFO] 
[INFO] --- ianal-maven-plugin:1.0-alpha-1:verify-legal-files (default) @ org.apache.sling.scripting.scala.forum
---
[INFO] Checking legal files in: org.apache.sling.scripting.scala.forum-0.9.0-SNAPSHOT.jar
[INFO] Checking legal files in: org.apache.sling.scripting.scala.forum-0.9.0-SNAPSHOT-sources.jar
[INFO] 
[INFO] --- apache-rat-plugin:0.11:check (default) @ org.apache.sling.scripting.scala.forum
---
[INFO] 51 implicit excludes (use -debug for more details).
[INFO] Exclude: src/main/appended-resources/META-INF/*
[INFO] Exclude: velocity.log
[INFO] Exclude: target/*
[INFO] Exclude: README.md
[INFO] Exclude: maven-eclipse.xml
[INFO] Exclude: .*
[INFO] Exclude: .*/**
[INFO] Exclude: **/*.json
[INFO] Exclude: DEPENDENCIES
[INFO] Exclude: **/*.rej
[INFO] 21 resources included (use -debug for more details)
[INFO] Rat check: Summary of files. Unapproved: 0 unknown: 0 generated: 0 approved: 17 licence.
[INFO] 
[INFO] --- maven-bundle-plugin:3.0.0:baseline (baseline) @ org.apache.sling.scripting.scala.forum
---
[INFO] artifact org.apache.sling:org.apache.sling.scripting.scala.forum: checking for updates
from Nexus
[INFO] artifact org.apache.sling:org.apache.sling.scripting.scala.forum: checking for updates
from central
[INFO] Unable to find a previous version of the project in the repository
[INFO] Not generating Baseline report as there is no previous version of the library to compare
against
[INFO] 
[INFO] --- maven-install-plugin:2.5.2:install (default-install) @ org.apache.sling.scripting.scala.forum
---
[INFO] Installing <https://builds.apache.org/job/sling-contrib-1.7/ws/trunk/scripting/scala/samples/forum/target/org.apache.sling.scripting.scala.forum-0.9.0-SNAPSHOT.jar>
to /home/jenkins/jenkins-slave/maven-repositories/1/org/apache/sling/org.apache.sling.scripting.scala.forum/0.9.0-SNAPSHOT/org.apache.sling.scripting.scala.forum-0.9.0-SNAPSHOT.jar
[INFO] Installing <https://builds.apache.org/job/sling-contrib-1.7/ws/trunk/scripting/scala/samples/forum/pom.xml>
to /home/jenkins/jenkins-slave/maven-repositories/1/org/apache/sling/org.apache.sling.scripting.scala.forum/0.9.0-SNAPSHOT/org.apache.sling.scripting.scala.forum-0.9.0-SNAPSHOT.pom
[INFO] Installing <https://builds.apache.org/job/sling-contrib-1.7/ws/trunk/scripting/scala/samples/forum/target/org.apache.sling.scripting.scala.forum-0.9.0-SNAPSHOT-sources.jar>
to /home/jenkins/jenkins-slave/maven-repositories/1/org/apache/sling/org.apache.sling.scripting.scala.forum/0.9.0-SNAPSHOT/org.apache.sling.scripting.scala.forum-0.9.0-SNAPSHOT-sources.jar
[INFO] 
[INFO] --- maven-bundle-plugin:3.0.0:install (default-install) @ org.apache.sling.scripting.scala.forum
---
[INFO] Local OBR update disabled (enable with -DobrRepository)
[JENKINS] Archiving disabled
[INFO]                                                                         
[INFO] ------------------------------------------------------------------------
[INFO] Building Apache Sling Scripting Thymeleaf 0.1.7-SNAPSHOT
[INFO] ------------------------------------------------------------------------
Downloading: http://repo.maven.apache.org/maven2/org/thymeleaf/thymeleaf/3.0.0.BETA01/thymeleaf-3.0.0.BETA01.pom
Downloaded: http://repo.maven.apache.org/maven2/org/thymeleaf/thymeleaf/3.0.0.BETA01/thymeleaf-3.0.0.BETA01.pom
(10 KB at 93.7 KB/sec)
Downloading: http://repo.maven.apache.org/maven2/org/attoparser/attoparser/2.0.0.BETA04/attoparser-2.0.0.BETA04.pom
Downloaded: http://repo.maven.apache.org/maven2/org/attoparser/attoparser/2.0.0.BETA04/attoparser-2.0.0.BETA04.pom
(10 KB at 137.1 KB/sec)
Downloading: http://repo.maven.apache.org/maven2/org/thymeleaf/thymeleaf/3.0.0.BETA01/thymeleaf-3.0.0.BETA01.jar
Downloading: http://repo.maven.apache.org/maven2/org/attoparser/attoparser/2.0.0.BETA04/attoparser-2.0.0.BETA04.jar
Downloaded: http://repo.maven.apache.org/maven2/org/attoparser/attoparser/2.0.0.BETA04/attoparser-2.0.0.BETA04.jar
(227 KB at 951.9 KB/sec)
Downloaded: http://repo.maven.apache.org/maven2/org/thymeleaf/thymeleaf/3.0.0.BETA01/thymeleaf-3.0.0.BETA01.jar
(723 KB at 2999.7 KB/sec)
[INFO] 
[INFO] --- maven-clean-plugin:2.5:clean (default-clean) @ org.apache.sling.scripting.thymeleaf
---
[INFO] 
[INFO] --- maven-enforcer-plugin:1.3.1:enforce (enforce-java) @ org.apache.sling.scripting.thymeleaf
---
[INFO] 
[INFO] --- maven-antrun-plugin:1.8:run (set-bundle-required-execution-environment) @ org.apache.sling.scripting.thymeleaf
---
[INFO] Executing tasks

main:
[INFO] Executed tasks
[INFO] 
[INFO] --- maven-remote-resources-plugin:1.5:process (default) @ org.apache.sling.scripting.thymeleaf
---
[INFO] 
[INFO] --- maven-resources-plugin:2.7:resources (default-resources) @ org.apache.sling.scripting.thymeleaf
---
[INFO] Using 'UTF-8' encoding to copy filtered resources.
[INFO] Copying 1 resource
[INFO] Copying 3 resources
[INFO] 
[INFO] --- maven-antrun-plugin:1.8:run (check-memory-task) @ org.apache.sling.scripting.thymeleaf
---
[INFO] Executing tasks

main:
     [echo] **************** WARNING (SLING-443/SLING-1782) ******************************
     [echo] On most platforms, you'll get OutOfMemoryErrors when building unless you set
     [echo] on 32bit platforms: MAVEN_OPTS="-Xmx256M -XX:MaxPermSize=256M", see SLING-443
     [echo] on 64bit platforms: MAVEN_OPTS="-Xmx512M -XX:MaxPermSize=512M", see SLING-1782
     [echo] ******************************************************************************
[INFO] Executed tasks
[INFO] 
[INFO] --- maven-compiler-plugin:3.1:compile (default-compile) @ org.apache.sling.scripting.thymeleaf
---
[INFO] Changes detected - recompiling the module!
[INFO] Compiling 11 source files to <https://builds.apache.org/job/sling-contrib-1.7/ws/trunk/scripting/thymeleaf/target/classes>
[INFO] -------------------------------------------------------------
[ERROR] COMPILATION ERROR : 
[INFO] -------------------------------------------------------------
[ERROR] <https://builds.apache.org/job/sling-contrib-1.7/ws/trunk/scripting/thymeleaf/src/main/java/org/apache/sling/scripting/thymeleaf/internal/NonCachingTemplateResolver.java>:[70,8]
org.apache.sling.scripting.thymeleaf.internal.NonCachingTemplateResolver is not abstract and
does not override abstract method resolveTemplate(org.thymeleaf.IEngineConfiguration,java.lang.String,java.lang.String,java.util.Map<java.lang.String,java.lang.Object>)
in org.thymeleaf.templateresolver.ITemplateResolver
[ERROR] <https://builds.apache.org/job/sling-contrib-1.7/ws/trunk/scripting/thymeleaf/src/main/java/org/apache/sling/scripting/thymeleaf/internal/NonCachingTemplateResolver.java>:[176,5]
method does not override or implement a method from a supertype
[INFO] 2 errors 
[INFO] -------------------------------------------------------------
[JENKINS] Archiving disabled
[INFO] ------------------------------------------------------------------------
[INFO] Reactor Summary:
[INFO] 
[INFO] Apache Sling OpenID Authentication ................ SUCCESS [29.261s]
[INFO] Apache Sling Authentication XING API .............. SUCCESS [5.017s]
[INFO] Apache Sling Authentication XING Login ............ SUCCESS [6.069s]
[INFO] Apache Sling Authentication XING OAuth ............ SUCCESS [5.655s]
[INFO] Apache Sling Authentication Selector .............. SUCCESS [3.500s]
[INFO] Apache Sling Commons HTML Utilities ............... SUCCESS [3.646s]
[INFO] Apache Sling APT parser ........................... SUCCESS [4.890s]
[INFO] Apache Sling APT servlet .......................... SUCCESS [5.587s]
[INFO] Apache Sling Resource Collection API .............. SUCCESS [4.533s]
[INFO] Apache Sling DataSource Provider .................. SUCCESS [10.620s]
[INFO] Apache Sling Dojo JavaScript Library .............. SUCCESS [10.530s]
[INFO] Apache Sling Dojo Data Extension .................. SUCCESS [3.024s]
[INFO] Apache Sling FTP Server ........................... SUCCESS [6.630s]
[INFO] Apache Sling Google Web Toolkit Servlet Library ... SUCCESS [5.770s]
[INFO] Apache Sling Google Web Toolkit Sample ............ SUCCESS [32.881s]
[INFO] Apache Sling JMX Resource Provider ................ SUCCESS [3.079s]
[INFO] Apache Sling ClassLoader Leak Detector ............ SUCCESS [3.693s]
[INFO] Apache Sling MongoDB Resource Provider ............ SUCCESS [3.399s]
[INFO] Apache Sling OSGi Bundle Repository ............... SUCCESS [5.258s]
[INFO] Apache Sling Distribution API ..................... SUCCESS [3.045s]
[INFO] Apache Sling Distribution Core .................... SUCCESS [12.312s]
[INFO] Apache Sling Distribution Extensions .............. SUCCESS [8.675s]
[INFO] Apache Sling Distribution Sample .................. SUCCESS [3.789s]
[INFO] Apache Sling Distribution Integration Tests ....... SUCCESS [5:39.570s]
[INFO] Apache Sling Log Tail Implementation .............. SUCCESS [5.728s]
[INFO] S3 dependencies for Oak ........................... SUCCESS [5.981s]
[INFO] Apache Sling Request Processing Analyzer .......... SUCCESS [3.234s]
[INFO] Apache Sling Resource Merger ...................... SUCCESS [5.621s]
[INFO] Apache Sling Inventory Printer Based on Resources . SUCCESS [3.161s]
[INFO] Apache Sling Rewriter ............................. SUCCESS [7.499s]
[INFO] Apache Sling Security ............................. SUCCESS [5.644s]
[INFO] Apache Sling SLF4J MDC Filter ..................... SUCCESS [11.172s]
[INFO] Apache Sling Query ................................ SUCCESS [6.530s]
[INFO] Apache Sling Superimposing Resource Provider ...... SUCCESS [4.916s]
[INFO] Apache Sling Tenant ............................... SUCCESS [4.703s]
[INFO] Apache Sling URL Rewriter ......................... SUCCESS [5.939s]
[INFO] Apache Sling JCR Java Compiler .................... SUCCESS [6.183s]
[INFO] Apache Sling Repository Accessor .................. SUCCESS [3.404s]
[INFO] Apache Sling Object Content Mapping ............... SUCCESS [5.721s]
[INFO] Apache Sling JCR Prefs ............................ SUCCESS [2.956s]
[INFO] Apache Sling JCR Resource Security ................ SUCCESS [2.876s]
[INFO] Apache Sling Script Console ....................... SUCCESS [3.743s]
[INFO] Apache Sling Atom Tag Library ..................... SUCCESS [4.252s]
[INFO] Apache Sling Scripting Freemarker Support ......... SUCCESS [33.436s]
[INFO] Apache Sling Scripting Groovy Support ............. SUCCESS [3.317s]
[INFO] Apache Sling Scripting Java Support ............... SUCCESS [4.157s]
[INFO] Apache Sling Scripting JST Support ................ SUCCESS [7.694s]
[INFO] Apache Sling Scripting Python Support ............. SUCCESS [5.653s]
[INFO] Apache Sling Scripting Ruby Support ............... SUCCESS [12.085s]
[INFO] Scala Script Engine ............................... SUCCESS [1:23.309s]
[INFO] Apache Sling Scala Scripting Configuration ........ SUCCESS [3.952s]
[INFO] Scala for Sling Demo Application - Hello World .... SUCCESS [4.188s]
[INFO] Scala for Sling Demo Application - Forum .......... SUCCESS [2.858s]
[INFO] Apache Sling Scripting Thymeleaf .................. FAILURE [2.378s]
[INFO] Apache Sling Scripting Velocity Support ........... SKIPPED
[INFO] Apache Sling Scripting W3C XML Processing Support . SKIPPED
[INFO] Apache Sling NoSQL Generic Resource Provider ...... SKIPPED
[INFO] Apache Sling NoSQL Couchbase Client ............... SKIPPED
[INFO] Apache Sling NoSQL Couchbase Resource Provider .... SKIPPED
[INFO] Apache Sling NoSQL MongoDB Resource Provider ...... SKIPPED
[INFO] Apache Sling Launchpad Contrib Testing ............ SKIPPED
[INFO] Apache Sling Launchpad Karaf - Features ........... SKIPPED
[INFO] Apache Sling Launchpad Karaf - Distribution ....... SKIPPED
[INFO] Apache Sling Launchpad Karaf - Integration Tests .. SKIPPED
[INFO] Apache Sling Launchpad Karaf Builder .............. SKIPPED
[INFO] Apache Sling Contrib (Builder) .................... SKIPPED
[INFO] ------------------------------------------------------------------------
[INFO] BUILD FAILURE
[INFO] ------------------------------------------------------------------------
[INFO] Total time: 13:41.689s
[INFO] Finished at: Mon Dec 07 15:42:28 UTC 2015
[INFO] Final Memory: 127M/416M
[INFO] ------------------------------------------------------------------------
[JENKINS] Archiving disabled
[JENKINS] Archiving disabled
[JENKINS] Archiving disabled
[JENKINS] Archiving disabled
[JENKINS] Archiving disabled
[JENKINS] Archiving disabled
[JENKINS] Archiving disabled
[JENKINS] Archiving disabled
[JENKINS] Archiving disabled
[JENKINS] Archiving disabled
[JENKINS] Archiving disabled
[JENKINS] Archiving disabled
[JENKINS] Archiving disabled
[JENKINS] Archiving disabled
[JENKINS] Archiving disabled
[JENKINS] Archiving disabled
[JENKINS] Archiving disabled
[JENKINS] Archiving disabled
[JENKINS] Archiving disabled
[JENKINS] Archiving disabled
[JENKINS] Archiving disabled
[JENKINS] Archiving disabled
[JENKINS] Archiving disabled
[JENKINS] Archiving disabled
[JENKINS] Archiving disabled
[JENKINS] Archiving disabled
[JENKINS] Archiving disabled
[JENKINS] Archiving disabled
[JENKINS] Archiving disabled
[JENKINS] Archiving disabled
[JENKINS] Archiving disabled
[JENKINS] Archiving disabled
[JENKINS] Archiving disabled
[JENKINS] Archiving disabled
[JENKINS] Archiving disabled
[JENKINS] Archiving disabled
[JENKINS] Archiving disabled
[JENKINS] Archiving disabled
[JENKINS] Archiving disabled
[JENKINS] Archiving disabled
[JENKINS] Archiving disabled
[JENKINS] Archiving disabled
[JENKINS] Archiving disabled
[JENKINS] Archiving disabled
[JENKINS] Archiving disabled
[JENKINS] Archiving disabled
[JENKINS] Archiving disabled
[JENKINS] Archiving disabled
[JENKINS] Archiving disabled
[JENKINS] Archiving disabled
[JENKINS] Archiving disabled
[JENKINS] Archiving disabled
[JENKINS] Archiving disabled
[JENKINS] Archiving disabled
[JENKINS] Archiving disabled
[JENKINS] Archiving disabled
[JENKINS] Archiving disabled
[JENKINS] Archiving disabled
[JENKINS] Archiving disabled
[JENKINS] Archiving disabled
[JENKINS] Archiving disabled
[JENKINS] Archiving disabled
[JENKINS] Archiving disabled
[JENKINS] Archiving disabled
[JENKINS] Archiving disabled
[JENKINS] Archiving disabled
Waiting for Jenkins to finish collecting data[ERROR] Failed to execute goal org.apache.maven.plugins:maven-compiler-plugin:3.1:compile
(default-compile) on project org.apache.sling.scripting.thymeleaf: Compilation failure: Compilation
failure:
[ERROR] <https://builds.apache.org/job/sling-contrib-1.7/ws/trunk/scripting/thymeleaf/src/main/java/org/apache/sling/scripting/thymeleaf/internal/NonCachingTemplateResolver.java>:[70,8]
org.apache.sling.scripting.thymeleaf.internal.NonCachingTemplateResolver is not abstract and
does not override abstract method resolveTemplate(org.thymeleaf.IEngineConfiguration,java.lang.String,java.lang.String,java.util.Map<java.lang.String,java.lang.Object>)
in org.thymeleaf.templateresolver.ITemplateResolver
[ERROR] <https://builds.apache.org/job/sling-contrib-1.7/ws/trunk/scripting/thymeleaf/src/main/java/org/apache/sling/scripting/thymeleaf/internal/NonCachingTemplateResolver.java>:[176,5]
method does not override or implement a method from a supertype
[ERROR] -> [Help 1]
[ERROR] 
[ERROR] To see the full stack trace of the errors, re-run Maven with the -e switch.
[ERROR] Re-run Maven using the -X switch to enable full debug logging.
[ERROR] 
[ERROR] For more information about the errors and possible solutions, please read the following
articles:
[ERROR] [Help 1] http://cwiki.apache.org/confluence/display/MAVEN/MojoFailureException
[ERROR] 
[ERROR] After correcting the problems, you can resume the build with the command
[ERROR]   mvn <goals> -rf :org.apache.sling.scripting.thymeleaf

channel stopped

Mime
View raw message