sling-commits mailing list archives

Site index · List index
Message view « Date » · « Thread »
Top « Date » · « Thread »
From Apache Jenkins Server <jenk...@builds.apache.org>
Subject Build failed in Jenkins: sling-contrib-1.7 #601
Date Fri, 27 Nov 2015 12:39:55 GMT
See <https://builds.apache.org/job/sling-contrib-1.7/601/changes>

Changes:

[mpetria] SLING-5336: improve logging for shared packages

------------------------------------------
[...truncated 11062 lines...]
<p>Resource type: <b>integration-test/srt.1448627962446</b></p>
<p>Resource super type: <b>-</b></p>
<h2>Resource properties</h2>
<p>
jcr:primaryType: <b>nt:unstructured</b><br />
text: <b>This is a test 1448627962446</b><br />
sling:resourceType: <b>integration-test/srt.1448627962446</b><br />
</p>
</body></html>
)

Tests run: 28, Failures: 7, Errors: 0, Skipped: 0

[JENKINS] Recording test results
[INFO] 
[INFO] --- slingstart-maven-plugin:1.2.0:stop (start-container) @ org.apache.sling.launchpad.contrib-testing
---
[INFO] Stopping 1 Launchpad instances
[INFO] Stopping Launchpad _-34900
27.11.2015 12:39:28.037 *INFO * [Apache Sling Terminator] Java VM is shutting down
27.11.2015 12:39:28.037 *INFO * [Apache Sling Terminator] Stopping Apache Sling
[INFO] 
[INFO] --- ianal-maven-plugin:1.0-alpha-1:verify-legal-files (default) @ org.apache.sling.launchpad.contrib-testing
---
[INFO] Checking legal files in: org.apache.sling.launchpad.contrib-testing-4-SNAPSHOT.jar
[INFO] Checking legal files in: org.apache.sling.launchpad.contrib-testing-4-SNAPSHOT-sources.jar
[INFO] 
[INFO] --- apache-rat-plugin:0.11:check (default) @ org.apache.sling.launchpad.contrib-testing
---
[INFO] 51 implicit excludes (use -debug for more details).
[INFO] Exclude: src/main/appended-resources/META-INF/*
[INFO] Exclude: velocity.log
[INFO] Exclude: target/*
[INFO] Exclude: README.md
[INFO] Exclude: maven-eclipse.xml
[INFO] Exclude: .*
[INFO] Exclude: .*/**
[INFO] Exclude: **/*.json
[INFO] Exclude: DEPENDENCIES
[INFO] Exclude: **/*.rej
[INFO] Exclude: src/test/resources/integration-test/**
[INFO] 23 resources included (use -debug for more details)
[INFO] Rat check: Summary of files. Unapproved: 0 unknown: 0 generated: 0 approved: 22 licence.
[INFO] 
[INFO] --- maven-failsafe-plugin:2.18.1:verify (default) @ org.apache.sling.launchpad.contrib-testing
---
[INFO] Failsafe report directory: <https://builds.apache.org/job/sling-contrib-1.7/ws/trunk/launchpad/testing/target/failsafe-reports>
[ERROR] There are test failures.

Please refer to <https://builds.apache.org/job/sling-contrib-1.7/ws/trunk/launchpad/testing/target/failsafe-reports>
for the individual test results.
[JENKINS] Recording test results[INFO] 
[INFO] --- maven-install-plugin:2.5.2:install (default-install) @ org.apache.sling.launchpad.contrib-testing
---
[INFO] Installing <https://builds.apache.org/job/sling-contrib-1.7/ws/trunk/launchpad/testing/target/org.apache.sling.launchpad.contrib-testing-4-SNAPSHOT.jar>
to /home/jenkins/jenkins-slave/maven-repositories/1/org/apache/sling/org.apache.sling.launchpad.contrib-testing/4-SNAPSHOT/org.apache.sling.launchpad.contrib-testing-4-SNAPSHOT.jar

[INFO] Installing <https://builds.apache.org/job/sling-contrib-1.7/ws/trunk/launchpad/testing/pom.xml>
to /home/jenkins/jenkins-slave/maven-repositories/1/org/apache/sling/org.apache.sling.launchpad.contrib-testing/4-SNAPSHOT/org.apache.sling.launchpad.contrib-testing-4-SNAPSHOT.pom
[INFO] Installing <https://builds.apache.org/job/sling-contrib-1.7/ws/trunk/launchpad/testing/target/slingstart.txt>
to /home/jenkins/jenkins-slave/maven-repositories/1/org/apache/sling/org.apache.sling.launchpad.contrib-testing/4-SNAPSHOT/org.apache.sling.launchpad.contrib-testing-4-SNAPSHOT-slingfeature.txt
[INFO] Installing <https://builds.apache.org/job/sling-contrib-1.7/ws/trunk/launchpad/testing/target/org.apache.sling.launchpad.contrib-testing-4-SNAPSHOT-sources.jar>
to /home/jenkins/jenkins-slave/maven-repositories/1/org/apache/sling/org.apache.sling.launchpad.contrib-testing/4-SNAPSHOT/org.apache.sling.launchpad.contrib-testing-4-SNAPSHOT-sources.jar
[JENKINS] Archiving disabled
[INFO]                                                                         
[INFO] ------------------------------------------------------------------------
[INFO] Building Apache Sling Launchpad Karaf 0.1.1-SNAPSHOT
[INFO] ------------------------------------------------------------------------
[INFO] 
[INFO] --- maven-clean-plugin:2.5:clean (default-clean) @ org.apache.sling.launchpad.karaf
---
[INFO] 
[INFO] --- maven-enforcer-plugin:1.3.1:enforce (enforce-java) @ org.apache.sling.launchpad.karaf
---
[INFO] 
[INFO] --- maven-antrun-plugin:1.8:run (set-bundle-required-execution-environment) @ org.apache.sling.launchpad.karaf
---
[INFO] Executing tasks

main:
Setting Bundle-RequiredExecutionEnvironment=JavaSE-1.8 from sling.java.version=8
[INFO] Executed tasks
[INFO] 
[INFO] --- maven-remote-resources-plugin:1.5:process (default) @ org.apache.sling.launchpad.karaf
---
[INFO] 
[INFO] --- maven-resources-plugin:2.7:resources (default-resources) @ org.apache.sling.launchpad.karaf
---
[INFO] Using 'UTF-8' encoding to copy filtered resources.
[INFO] skip non existing resourceDirectory <https://builds.apache.org/job/sling-contrib-1.7/ws/trunk/launchpad/karaf/org.apache.sling.launchpad.karaf/src/main/resources>
[INFO] Copying 3 resources
[INFO] 
[INFO] --- maven-antrun-plugin:1.8:run (check-memory-task) @ org.apache.sling.launchpad.karaf
---
[INFO] Executing tasks

main:
     [echo] **************** WARNING (SLING-443/SLING-1782) ******************************
     [echo] On most platforms, you'll get OutOfMemoryErrors when building unless you set
     [echo] on 32bit platforms: MAVEN_OPTS="-Xmx256M -XX:MaxPermSize=256M", see SLING-443
     [echo] on 64bit platforms: MAVEN_OPTS="-Xmx512M -XX:MaxPermSize=512M", see SLING-1782
     [echo] ******************************************************************************
[INFO] Executed tasks
[INFO] 
[INFO] --- maven-compiler-plugin:3.3:compile (default-compile) @ org.apache.sling.launchpad.karaf
---
[INFO] Changes detected - recompiling the module!
[INFO] Compiling 3 source files to <https://builds.apache.org/job/sling-contrib-1.7/ws/trunk/launchpad/karaf/org.apache.sling.launchpad.karaf/target/classes>
[JENKINS] Archiving disabled
[INFO] ------------------------------------------------------------------------
[INFO] Reactor Summary:
[INFO] 
[INFO] Apache Sling OpenID Authentication ................ SUCCESS [26.209s]
[INFO] Apache Sling Authentication XING API .............. SUCCESS [3.015s]
[INFO] Apache Sling Authentication XING Login ............ SUCCESS [4.539s]
[INFO] Apache Sling Authentication XING OAuth ............ SUCCESS [4.642s]
[INFO] Apache Sling Authentication Selector .............. SUCCESS [4.613s]
[INFO] Apache Sling Commons HTML Utilities ............... SUCCESS [2.663s]
[INFO] Apache Sling APT parser ........................... SUCCESS [4.079s]
[INFO] Apache Sling APT servlet .......................... SUCCESS [2.778s]
[INFO] Apache Sling Resource Collection API .............. SUCCESS [3.174s]
[INFO] Apache Sling DataSource Provider .................. SUCCESS [8.661s]
[INFO] Apache Sling Dojo JavaScript Library .............. SUCCESS [9.345s]
[INFO] Apache Sling Dojo Data Extension .................. SUCCESS [2.860s]
[INFO] Apache Sling FTP Server ........................... SUCCESS [3.826s]
[INFO] Apache Sling Google Web Toolkit Servlet Library ... SUCCESS [4.287s]
[INFO] Apache Sling Google Web Toolkit Sample ............ SUCCESS [38.982s]
[INFO] Apache Sling JMX Resource Provider ................ SUCCESS [2.725s]
[INFO] Apache Sling ClassLoader Leak Detector ............ SUCCESS [2.600s]
[INFO] Apache Sling MongoDB Resource Provider ............ SUCCESS [2.595s]
[INFO] Apache Sling OSGi Bundle Repository ............... SUCCESS [3.981s]
[INFO] Apache Sling Distribution API ..................... SUCCESS [2.514s]
[INFO] Apache Sling Distribution Core .................... SUCCESS [9.539s]
[INFO] Apache Sling Distribution Extensions .............. SUCCESS [6.467s]
[INFO] Apache Sling Distribution Sample .................. SUCCESS [2.921s]
[INFO] Apache Sling Distribution Integration Tests ....... SUCCESS [5:03.551s]
[INFO] Apache Sling Log Tail Implementation .............. SUCCESS [4.969s]
[INFO] S3 dependencies for Oak ........................... SUCCESS [4.402s]
[INFO] Apache Sling Request Processing Analyzer .......... SUCCESS [2.543s]
[INFO] Apache Sling Resource Merger ...................... SUCCESS [3.379s]
[INFO] Apache Sling Inventory Printer Based on Resources . SUCCESS [2.380s]
[INFO] Apache Sling Rewriter ............................. SUCCESS [6.993s]
[INFO] Apache Sling Security ............................. SUCCESS [4.031s]
[INFO] Apache Sling SLF4J MDC Filter ..................... SUCCESS [9.052s]
[INFO] Apache Sling Query ................................ SUCCESS [5.297s]
[INFO] Apache Sling Superimposing Resource Provider ...... SUCCESS [3.958s]
[INFO] Apache Sling Tenant ............................... SUCCESS [3.325s]
[INFO] Apache Sling URL Rewriter ......................... SUCCESS [2.704s]
[INFO] Apache Sling JCR Java Compiler .................... SUCCESS [7.891s]
[INFO] Apache Sling Repository Accessor .................. SUCCESS [2.473s]
[INFO] Apache Sling Object Content Mapping ............... SUCCESS [6.958s]
[INFO] Apache Sling JCR Prefs ............................ SUCCESS [2.334s]
[INFO] Apache Sling JCR Resource Security ................ SUCCESS [2.521s]
[INFO] Apache Sling Script Console ....................... SUCCESS [2.528s]
[INFO] Apache Sling Atom Tag Library ..................... SUCCESS [2.832s]
[INFO] Apache Sling Scripting Freemarker Support ......... SUCCESS [31.724s]
[INFO] Apache Sling Scripting Groovy Support ............. SUCCESS [2.823s]
[INFO] Apache Sling Scripting Java Support ............... SUCCESS [3.530s]
[INFO] Apache Sling Scripting JST Support ................ SUCCESS [6.958s]
[INFO] Apache Sling Scripting Python Support ............. SUCCESS [3.892s]
[INFO] Apache Sling Scripting Ruby Support ............... SUCCESS [11.404s]
[INFO] Scala Script Engine ............................... SUCCESS [1:20.491s]
[INFO] Apache Sling Scala Scripting Configuration ........ SUCCESS [3.605s]
[INFO] Scala for Sling Demo Application - Hello World .... SUCCESS [2.263s]
[INFO] Scala for Sling Demo Application - Forum .......... SUCCESS [2.336s]
[INFO] Apache Sling Scripting Thymeleaf .................. SUCCESS [6.594s]
[INFO] Apache Sling Scripting Velocity Support ........... SUCCESS [4.231s]
[INFO] Apache Sling Scripting W3C XML Processing Support . SUCCESS [3.992s]
[INFO] Apache Sling NoSQL Generic Resource Provider ...... SUCCESS [5.047s]
[INFO] Apache Sling NoSQL Couchbase Client ............... SUCCESS [5.190s]
[INFO] Apache Sling NoSQL Couchbase Resource Provider .... SUCCESS [3.073s]
[INFO] Apache Sling NoSQL MongoDB Resource Provider ...... SUCCESS [2.955s]
[INFO] Apache Sling Launchpad Contrib Testing ............ SUCCESS [55.485s]
[INFO] Apache Sling Launchpad Karaf ...................... FAILURE [1.249s]
[INFO] Apache Sling Launchpad Karaf - Features ........... SKIPPED
[INFO] Apache Sling Launchpad Karaf - Distribution ....... SKIPPED
[INFO] Apache Sling Launchpad Karaf - Integration Tests .. SKIPPED
[INFO] Apache Sling Launchpad Karaf Builder .............. SKIPPED
[INFO] Apache Sling Contrib (Builder) .................... SKIPPED
[INFO] ------------------------------------------------------------------------
[INFO] BUILD FAILURE
[INFO] ------------------------------------------------------------------------
[INFO] Total time: 13:30.534s
[INFO] Finished at: Fri Nov 27 12:39:33 UTC 2015
27.11.2015 12:39:34.593 *INFO * [Sling Notifier] Apache Sling has been stopped
[INFO] Final Memory: 156M/413M
[INFO] ------------------------------------------------------------------------
[JENKINS] Archiving disabled
[JENKINS] Archiving disabled
[JENKINS] Archiving disabled
[JENKINS] Archiving disabled
[JENKINS] Archiving disabled
[JENKINS] Archiving disabled
[JENKINS] Archiving disabled
[JENKINS] Archiving disabled
[JENKINS] Archiving disabled
[JENKINS] Archiving disabled
[JENKINS] Archiving disabled
[JENKINS] Archiving disabled
[JENKINS] Archiving disabled
[JENKINS] Archiving disabled
[JENKINS] Archiving disabled
[JENKINS] Archiving disabled
[JENKINS] Archiving disabled
[JENKINS] Archiving disabled
[JENKINS] Archiving disabled
[JENKINS] Archiving disabled
[JENKINS] Archiving disabled
[JENKINS] Archiving disabled
[JENKINS] Archiving disabled
[JENKINS] Archiving disabled
[JENKINS] Archiving disabled
[JENKINS] Archiving disabled
[JENKINS] Archiving disabled
[JENKINS] Archiving disabled
[JENKINS] Archiving disabled
[JENKINS] Archiving disabled
[JENKINS] Archiving disabled
[JENKINS] Archiving disabled
[JENKINS] Archiving disabled
[JENKINS] Archiving disabled
[JENKINS] Archiving disabled
[JENKINS] Archiving disabled
[JENKINS] Archiving disabled
[JENKINS] Archiving disabled
[JENKINS] Archiving disabled
[JENKINS] Archiving disabled
[JENKINS] Archiving disabled
[JENKINS] Archiving disabled
[JENKINS] Archiving disabled
[JENKINS] Archiving disabled
[JENKINS] Archiving disabled
[JENKINS] Archiving disabled
[JENKINS] Archiving disabled
[JENKINS] Archiving disabled
[JENKINS] Archiving disabled
[JENKINS] Archiving disabled
[JENKINS] Archiving disabled
[JENKINS] Archiving disabled
[JENKINS] Archiving disabled
[JENKINS] Archiving disabled
[JENKINS] Archiving disabled
[JENKINS] Archiving disabled
[JENKINS] Archiving disabled
[JENKINS] Archiving disabled
[JENKINS] Archiving disabled
[JENKINS] Archiving disabled
[JENKINS] Archiving disabled
[JENKINS] Archiving disabled
[JENKINS] Archiving disabled
[JENKINS] Archiving disabled
[JENKINS] Archiving disabled
[JENKINS] Archiving disabled
[JENKINS] Archiving disabled
Waiting for Jenkins to finish collecting data
[ERROR] Failed to execute goal org.apache.maven.plugins:maven-compiler-plugin:3.3:compile
(default-compile) on project org.apache.sling.launchpad.karaf: Fatal error compiling: invalid
target release: 1.8 -> [Help 1]
[ERROR] 
[ERROR] To see the full stack trace of the errors, re-run Maven with the -e switch.
[ERROR] Re-run Maven using the -X switch to enable full debug logging.
[ERROR] 
[ERROR] For more information about the errors and possible solutions, please read the following
articles:
[ERROR] [Help 1] http://cwiki.apache.org/confluence/display/MAVEN/MojoExecutionException
[ERROR] 
[ERROR] After correcting the problems, you can resume the build with the command
[ERROR]   mvn <goals> -rf :org.apache.sling.launchpad.karaf
channel stopped

Mime
View raw message