sling-commits mailing list archives

Site index · List index
Message view « Date » · « Thread »
Top « Date » · « Thread »
From Apache Jenkins Server <jenk...@builds.apache.org>
Subject Build failed in Jenkins: sling-contrib-1.7 #542
Date Wed, 11 Nov 2015 15:07:41 GMT
See <https://builds.apache.org/job/sling-contrib-1.7/542/>

------------------------------------------
[...truncated 3787 lines...]
[JENKINS] Archiving disabled
[JENKINS] Archiving disabled
[JENKINS] Archiving disabled
[JENKINS] Archiving disabled
[JENKINS] Archiving disabled
[JENKINS] Archiving disabled
[JENKINS] Archiving disabled
[JENKINS] Archiving disabled
[JENKINS] Archiving disabled
[JENKINS] Archiving disabled
[JENKINS] Archiving disabled
[JENKINS] Archiving disabled
[JENKINS] Archiving disabled
[JENKINS] Archiving disabled
[JENKINS] Archiving disabled
[JENKINS] Archiving disabled
[JENKINS] Archiving disabled
[JENKINS] Archiving disabled
[JENKINS] Archiving disabled
[JENKINS] Archiving disabled
[JENKINS] Archiving disabled
[JENKINS] Archiving disabled
[JENKINS] Archiving disabled
[JENKINS] Archiving disabled
[JENKINS] Archiving disabled
[JENKINS] Archiving disabled
[JENKINS] Archiving disabled
[JENKINS] Archiving disabled
[JENKINS] Archiving disabled
[JENKINS] Archiving disabled
[JENKINS] Archiving disabled
[JENKINS] Archiving disabled
[JENKINS] Archiving disabled
[JENKINS] Archiving disabled
[JENKINS] Archiving disabled
[JENKINS] Archiving disabled
[JENKINS] Archiving disabled
[JENKINS] Archiving disabled
[JENKINS] Archiving disabled
[JENKINS] Archiving disabled
[JENKINS] Archiving disabled
[JENKINS] Archiving disabled
[JENKINS] Archiving disabled
[JENKINS] Archiving disabled
[JENKINS] Archiving disabled
Waiting for Jenkins to finish collecting data
[ERROR] Failed to execute goal org.apache.maven.plugins:maven-compiler-plugin:3.2:compile
(default-compile) on project org.apache.sling.distribution.extensions: Compilation failure:
Compilation failure:
[ERROR] <https://builds.apache.org/job/sling-contrib-1.7/ws/trunk/extensions/distribution/extensions/src/main/java/org/apache/sling/distribution/serialization/impl/kryo/KryoDistributionPackageBuilderFactory.java>:[34,37]
cannot find symbol
[ERROR] symbol:   class DistributionException
[ERROR] location: package org.apache.sling.distribution
[ERROR] <https://builds.apache.org/job/sling-contrib-1.7/ws/trunk/extensions/distribution/extensions/src/main/java/org/apache/sling/distribution/serialization/impl/kryo/KryoDistributionPackageBuilderFactory.java>:[36,51]
cannot find symbol
[ERROR] symbol:   class DistributionPackage
[ERROR] location: package org.apache.sling.distribution.serialization
[ERROR] <https://builds.apache.org/job/sling-contrib-1.7/ws/trunk/extensions/distribution/extensions/src/main/java/org/apache/sling/distribution/serialization/impl/kryo/KryoDistributionPackageBuilderFactory.java>:[37,51]
cannot find symbol
[ERROR] symbol:   class DistributionPackageBuilder
[ERROR] location: package org.apache.sling.distribution.serialization
[ERROR] <https://builds.apache.org/job/sling-contrib-1.7/ws/trunk/extensions/distribution/extensions/src/main/java/org/apache/sling/distribution/serialization/impl/kryo/KryoDistributionPackageBuilderFactory.java>:[52,63]
cannot find symbol
[ERROR] symbol: class DistributionPackageBuilder
[ERROR] <https://builds.apache.org/job/sling-contrib-1.7/ws/trunk/extensions/distribution/extensions/src/main/java/org/apache/sling/distribution/serialization/impl/kryo/KryoDistributionPackageBuilderFactory.java>:[83,13]
cannot find symbol
[ERROR] symbol:   class DistributionPackageBuilder
[ERROR] location: class org.apache.sling.distribution.serialization.impl.kryo.KryoDistributionPackageBuilderFactory
[ERROR] <https://builds.apache.org/job/sling-contrib-1.7/ws/trunk/extensions/distribution/extensions/src/main/java/org/apache/sling/distribution/serialization/impl/kryo/KryoDistributionPackageBuilderFactory.java>:[106,12]
cannot find symbol
[ERROR] symbol:   class DistributionPackage
[ERROR] location: class org.apache.sling.distribution.serialization.impl.kryo.KryoDistributionPackageBuilderFactory
[ERROR] <https://builds.apache.org/job/sling-contrib-1.7/ws/trunk/extensions/distribution/extensions/src/main/java/org/apache/sling/distribution/serialization/impl/kryo/KryoDistributionPackageBuilderFactory.java>:[106,135]
cannot find symbol
[ERROR] symbol:   class DistributionException
[ERROR] location: class org.apache.sling.distribution.serialization.impl.kryo.KryoDistributionPackageBuilderFactory
[ERROR] <https://builds.apache.org/job/sling-contrib-1.7/ws/trunk/extensions/distribution/extensions/src/main/java/org/apache/sling/distribution/serialization/impl/kryo/KryoDistributionPackageBuilderFactory.java>:[111,12]
cannot find symbol
[ERROR] symbol:   class DistributionPackage
[ERROR] location: class org.apache.sling.distribution.serialization.impl.kryo.KryoDistributionPackageBuilderFactory
[ERROR] <https://builds.apache.org/job/sling-contrib-1.7/ws/trunk/extensions/distribution/extensions/src/main/java/org/apache/sling/distribution/serialization/impl/kryo/KryoDistributionPackageBuilderFactory.java>:[111,124]
cannot find symbol
[ERROR] symbol:   class DistributionException
[ERROR] location: class org.apache.sling.distribution.serialization.impl.kryo.KryoDistributionPackageBuilderFactory
[ERROR] <https://builds.apache.org/job/sling-contrib-1.7/ws/trunk/extensions/distribution/extensions/src/main/java/org/apache/sling/distribution/serialization/impl/kryo/KryoDistributionPackageBuilderFactory.java>:[116,12]
cannot find symbol
[ERROR] symbol:   class DistributionPackage
[ERROR] location: class org.apache.sling.distribution.serialization.impl.kryo.KryoDistributionPackageBuilderFactory
[ERROR] <https://builds.apache.org/job/sling-contrib-1.7/ws/trunk/extensions/distribution/extensions/src/main/java/org/apache/sling/distribution/serialization/impl/kryo/KryoDistributionPackageBuilderFactory.java>:[116,114]
cannot find symbol
[ERROR] symbol:   class DistributionException
[ERROR] location: class org.apache.sling.distribution.serialization.impl.kryo.KryoDistributionPackageBuilderFactory
[ERROR] <https://builds.apache.org/job/sling-contrib-1.7/ws/trunk/extensions/distribution/extensions/src/main/java/org/apache/sling/distribution/serialization/impl/kryo/KryoDistributionPackageBuilderFactory.java>:[120,88]
cannot find symbol
[ERROR] symbol:   class DistributionPackage
[ERROR] location: class org.apache.sling.distribution.serialization.impl.kryo.KryoDistributionPackageBuilderFactory
[ERROR] <https://builds.apache.org/job/sling-contrib-1.7/ws/trunk/extensions/distribution/extensions/src/main/java/org/apache/sling/distribution/serialization/impl/kryo/KryoDistributionPackageBuilderFactory.java>:[120,136]
cannot find symbol
[ERROR] symbol:   class DistributionException
[ERROR] location: class org.apache.sling.distribution.serialization.impl.kryo.KryoDistributionPackageBuilderFactory
[ERROR] <https://builds.apache.org/job/sling-contrib-1.7/ws/trunk/extensions/distribution/extensions/src/main/java/org/apache/sling/distribution/serialization/impl/FileDistributionPackage.java>:[27,51]
cannot find symbol
[ERROR] symbol:   class DistributionPackage
[ERROR] location: package org.apache.sling.distribution.serialization
[ERROR] <https://builds.apache.org/job/sling-contrib-1.7/ws/trunk/extensions/distribution/extensions/src/main/java/org/apache/sling/distribution/serialization/impl/FileDistributionPackage.java>:[28,51]
cannot find symbol
[ERROR] symbol:   class DistributionPackageInfo
[ERROR] location: package org.apache.sling.distribution.serialization
[ERROR] <https://builds.apache.org/job/sling-contrib-1.7/ws/trunk/extensions/distribution/extensions/src/main/java/org/apache/sling/distribution/serialization/impl/FileDistributionPackage.java>:[33,49]
cannot find symbol
[ERROR] symbol: class DistributionPackage
[ERROR] <https://builds.apache.org/job/sling-contrib-1.7/ws/trunk/extensions/distribution/extensions/src/main/java/org/apache/sling/distribution/serialization/impl/FileDistributionPackage.java>:[37,19]
cannot find symbol
[ERROR] symbol:   class DistributionPackageInfo
[ERROR] location: class org.apache.sling.distribution.serialization.impl.FileDistributionPackage
[ERROR] <https://builds.apache.org/job/sling-contrib-1.7/ws/trunk/extensions/distribution/extensions/src/main/java/org/apache/sling/distribution/serialization/impl/FileDistributionPackage.java>:[70,12]
cannot find symbol
[ERROR] symbol:   class DistributionPackageInfo
[ERROR] location: class org.apache.sling.distribution.serialization.impl.FileDistributionPackage
[ERROR] <https://builds.apache.org/job/sling-contrib-1.7/ws/trunk/extensions/distribution/extensions/src/main/java/org/apache/sling/distribution/serialization/impl/kryo/KryoResourceDistributionPackageBuilder.java>:[48,37]
cannot find symbol
[ERROR] symbol:   class DistributionException
[ERROR] location: package org.apache.sling.distribution
[ERROR] <https://builds.apache.org/job/sling-contrib-1.7/ws/trunk/extensions/distribution/extensions/src/main/java/org/apache/sling/distribution/serialization/impl/kryo/KryoResourceDistributionPackageBuilder.java>:[50,51]
cannot find symbol
[ERROR] symbol:   class DistributionPackage
[ERROR] location: package org.apache.sling.distribution.serialization
[ERROR] <https://builds.apache.org/job/sling-contrib-1.7/ws/trunk/extensions/distribution/extensions/src/main/java/org/apache/sling/distribution/serialization/impl/kryo/KryoResourceDistributionPackageBuilder.java>:[51,51]
cannot find symbol
[ERROR] symbol:   class DistributionPackageBuilder
[ERROR] location: package org.apache.sling.distribution.serialization
[ERROR] <https://builds.apache.org/job/sling-contrib-1.7/ws/trunk/extensions/distribution/extensions/src/main/java/org/apache/sling/distribution/serialization/impl/kryo/KryoResourceDistributionPackageBuilder.java>:[61,64]
cannot find symbol
[ERROR] symbol: class DistributionPackageBuilder
[ERROR] <https://builds.apache.org/job/sling-contrib-1.7/ws/trunk/extensions/distribution/extensions/src/main/java/org/apache/sling/distribution/serialization/impl/kryo/KryoResourceDistributionPackageBuilder.java>:[96,12]
cannot find symbol
[ERROR] symbol:   class DistributionPackage
[ERROR] location: class org.apache.sling.distribution.serialization.impl.kryo.KryoResourceDistributionPackageBuilder
[ERROR] <https://builds.apache.org/job/sling-contrib-1.7/ws/trunk/extensions/distribution/extensions/src/main/java/org/apache/sling/distribution/serialization/impl/kryo/KryoResourceDistributionPackageBuilder.java>:[96,135]
cannot find symbol
[ERROR] symbol:   class DistributionException
[ERROR] location: class org.apache.sling.distribution.serialization.impl.kryo.KryoResourceDistributionPackageBuilder
[ERROR] <https://builds.apache.org/job/sling-contrib-1.7/ws/trunk/extensions/distribution/extensions/src/main/java/org/apache/sling/distribution/serialization/impl/kryo/KryoResourceDistributionPackageBuilder.java>:[129,12]
cannot find symbol
[ERROR] symbol:   class DistributionPackage
[ERROR] location: class org.apache.sling.distribution.serialization.impl.kryo.KryoResourceDistributionPackageBuilder
[ERROR] <https://builds.apache.org/job/sling-contrib-1.7/ws/trunk/extensions/distribution/extensions/src/main/java/org/apache/sling/distribution/serialization/impl/kryo/KryoResourceDistributionPackageBuilder.java>:[129,124]
cannot find symbol
[ERROR] symbol:   class DistributionException
[ERROR] location: class org.apache.sling.distribution.serialization.impl.kryo.KryoResourceDistributionPackageBuilder
[ERROR] <https://builds.apache.org/job/sling-contrib-1.7/ws/trunk/extensions/distribution/extensions/src/main/java/org/apache/sling/distribution/serialization/impl/kryo/KryoResourceDistributionPackageBuilder.java>:[144,12]
cannot find symbol
[ERROR] symbol:   class DistributionPackage
[ERROR] location: class org.apache.sling.distribution.serialization.impl.kryo.KryoResourceDistributionPackageBuilder
[ERROR] <https://builds.apache.org/job/sling-contrib-1.7/ws/trunk/extensions/distribution/extensions/src/main/java/org/apache/sling/distribution/serialization/impl/kryo/KryoResourceDistributionPackageBuilder.java>:[153,88]
cannot find symbol
[ERROR] symbol:   class DistributionPackage
[ERROR] location: class org.apache.sling.distribution.serialization.impl.kryo.KryoResourceDistributionPackageBuilder
[ERROR] <https://builds.apache.org/job/sling-contrib-1.7/ws/trunk/extensions/distribution/extensions/src/main/java/org/apache/sling/distribution/serialization/impl/kryo/KryoResourceDistributionPackageBuilder.java>:[153,136]
cannot find symbol
[ERROR] symbol:   class DistributionException
[ERROR] location: class org.apache.sling.distribution.serialization.impl.kryo.KryoResourceDistributionPackageBuilder
[ERROR] <https://builds.apache.org/job/sling-contrib-1.7/ws/trunk/extensions/distribution/extensions/src/main/java/org/apache/sling/distribution/serialization/impl/avro/AvroDistributionPackageBuilder.java>:[58,37]
cannot find symbol
[ERROR] symbol:   class DistributionException
[ERROR] location: package org.apache.sling.distribution
[ERROR] <https://builds.apache.org/job/sling-contrib-1.7/ws/trunk/extensions/distribution/extensions/src/main/java/org/apache/sling/distribution/serialization/impl/avro/AvroDistributionPackageBuilder.java>:[60,51]
cannot find symbol
[ERROR] symbol:   class DistributionPackage
[ERROR] location: package org.apache.sling.distribution.serialization
[ERROR] <https://builds.apache.org/job/sling-contrib-1.7/ws/trunk/extensions/distribution/extensions/src/main/java/org/apache/sling/distribution/serialization/impl/avro/AvroDistributionPackageBuilder.java>:[61,51]
cannot find symbol
[ERROR] symbol:   class DistributionPackageBuilder
[ERROR] location: package org.apache.sling.distribution.serialization
[ERROR] <https://builds.apache.org/job/sling-contrib-1.7/ws/trunk/extensions/distribution/extensions/src/main/java/org/apache/sling/distribution/serialization/impl/avro/AvroDistributionPackageBuilder.java>:[69,56]
cannot find symbol
[ERROR] symbol: class DistributionPackageBuilder
[ERROR] <https://builds.apache.org/job/sling-contrib-1.7/ws/trunk/extensions/distribution/extensions/src/main/java/org/apache/sling/distribution/serialization/impl/avro/AvroDistributionPackageBuilder.java>:[112,12]
cannot find symbol
[ERROR] symbol:   class DistributionPackage
[ERROR] location: class org.apache.sling.distribution.serialization.impl.avro.AvroDistributionPackageBuilder
[ERROR] <https://builds.apache.org/job/sling-contrib-1.7/ws/trunk/extensions/distribution/extensions/src/main/java/org/apache/sling/distribution/serialization/impl/avro/AvroDistributionPackageBuilder.java>:[112,135]
cannot find symbol
[ERROR] symbol:   class DistributionException
[ERROR] location: class org.apache.sling.distribution.serialization.impl.avro.AvroDistributionPackageBuilder
[ERROR] <https://builds.apache.org/job/sling-contrib-1.7/ws/trunk/extensions/distribution/extensions/src/main/java/org/apache/sling/distribution/serialization/impl/avro/AvroDistributionPackageBuilder.java>:[176,12]
cannot find symbol
[ERROR] symbol:   class DistributionPackage
[ERROR] location: class org.apache.sling.distribution.serialization.impl.avro.AvroDistributionPackageBuilder
[ERROR] <https://builds.apache.org/job/sling-contrib-1.7/ws/trunk/extensions/distribution/extensions/src/main/java/org/apache/sling/distribution/serialization/impl/avro/AvroDistributionPackageBuilder.java>:[176,124]
cannot find symbol
[ERROR] symbol:   class DistributionException
[ERROR] location: class org.apache.sling.distribution.serialization.impl.avro.AvroDistributionPackageBuilder
[ERROR] <https://builds.apache.org/job/sling-contrib-1.7/ws/trunk/extensions/distribution/extensions/src/main/java/org/apache/sling/distribution/serialization/impl/avro/AvroDistributionPackageBuilder.java>:[207,12]
cannot find symbol
[ERROR] symbol:   class DistributionPackage
[ERROR] location: class org.apache.sling.distribution.serialization.impl.avro.AvroDistributionPackageBuilder
[ERROR] <https://builds.apache.org/job/sling-contrib-1.7/ws/trunk/extensions/distribution/extensions/src/main/java/org/apache/sling/distribution/serialization/impl/avro/AvroDistributionPackageBuilder.java>:[217,88]
cannot find symbol
[ERROR] symbol:   class DistributionPackage
[ERROR] location: class org.apache.sling.distribution.serialization.impl.avro.AvroDistributionPackageBuilder
[ERROR] <https://builds.apache.org/job/sling-contrib-1.7/ws/trunk/extensions/distribution/extensions/src/main/java/org/apache/sling/distribution/serialization/impl/avro/AvroDistributionPackageBuilder.java>:[217,136]
cannot find symbol
[ERROR] symbol:   class DistributionException
[ERROR] location: class org.apache.sling.distribution.serialization.impl.avro.AvroDistributionPackageBuilder
[ERROR] <https://builds.apache.org/job/sling-contrib-1.7/ws/trunk/extensions/distribution/extensions/src/main/java/org/apache/sling/distribution/serialization/impl/avro/AvroDistributionPackageBuilderFactory.java>:[34,37]
cannot find symbol
[ERROR] symbol:   class DistributionException
[ERROR] location: package org.apache.sling.distribution
[ERROR] <https://builds.apache.org/job/sling-contrib-1.7/ws/trunk/extensions/distribution/extensions/src/main/java/org/apache/sling/distribution/serialization/impl/avro/AvroDistributionPackageBuilderFactory.java>:[36,51]
cannot find symbol
[ERROR] symbol:   class DistributionPackage
[ERROR] location: package org.apache.sling.distribution.serialization
[ERROR] <https://builds.apache.org/job/sling-contrib-1.7/ws/trunk/extensions/distribution/extensions/src/main/java/org/apache/sling/distribution/serialization/impl/avro/AvroDistributionPackageBuilderFactory.java>:[37,51]
cannot find symbol
[ERROR] symbol:   class DistributionPackageBuilder
[ERROR] location: package org.apache.sling.distribution.serialization
[ERROR] <https://builds.apache.org/job/sling-contrib-1.7/ws/trunk/extensions/distribution/extensions/src/main/java/org/apache/sling/distribution/serialization/impl/avro/AvroDistributionPackageBuilderFactory.java>:[52,63]
cannot find symbol
[ERROR] symbol: class DistributionPackageBuilder
[ERROR] <https://builds.apache.org/job/sling-contrib-1.7/ws/trunk/extensions/distribution/extensions/src/main/java/org/apache/sling/distribution/serialization/impl/avro/AvroDistributionPackageBuilderFactory.java>:[83,13]
cannot find symbol
[ERROR] symbol:   class DistributionPackageBuilder
[ERROR] location: class org.apache.sling.distribution.serialization.impl.avro.AvroDistributionPackageBuilderFactory
[ERROR] <https://builds.apache.org/job/sling-contrib-1.7/ws/trunk/extensions/distribution/extensions/src/main/java/org/apache/sling/distribution/serialization/impl/avro/AvroDistributionPackageBuilderFactory.java>:[106,12]
cannot find symbol
[ERROR] symbol:   class DistributionPackage
[ERROR] location: class org.apache.sling.distribution.serialization.impl.avro.AvroDistributionPackageBuilderFactory
[ERROR] <https://builds.apache.org/job/sling-contrib-1.7/ws/trunk/extensions/distribution/extensions/src/main/java/org/apache/sling/distribution/serialization/impl/avro/AvroDistributionPackageBuilderFactory.java>:[106,135]
cannot find symbol
[ERROR] symbol:   class DistributionException
[ERROR] location: class org.apache.sling.distribution.serialization.impl.avro.AvroDistributionPackageBuilderFactory
[ERROR] <https://builds.apache.org/job/sling-contrib-1.7/ws/trunk/extensions/distribution/extensions/src/main/java/org/apache/sling/distribution/serialization/impl/avro/AvroDistributionPackageBuilderFactory.java>:[111,12]
cannot find symbol
[ERROR] symbol:   class DistributionPackage
[ERROR] location: class org.apache.sling.distribution.serialization.impl.avro.AvroDistributionPackageBuilderFactory
[ERROR] <https://builds.apache.org/job/sling-contrib-1.7/ws/trunk/extensions/distribution/extensions/src/main/java/org/apache/sling/distribution/serialization/impl/avro/AvroDistributionPackageBuilderFactory.java>:[111,124]
cannot find symbol
[ERROR] symbol:   class DistributionException
[ERROR] location: class org.apache.sling.distribution.serialization.impl.avro.AvroDistributionPackageBuilderFactory
[ERROR] <https://builds.apache.org/job/sling-contrib-1.7/ws/trunk/extensions/distribution/extensions/src/main/java/org/apache/sling/distribution/serialization/impl/avro/AvroDistributionPackageBuilderFactory.java>:[116,12]
cannot find symbol
[ERROR] symbol:   class DistributionPackage
[ERROR] location: class org.apache.sling.distribution.serialization.impl.avro.AvroDistributionPackageBuilderFactory
[ERROR] <https://builds.apache.org/job/sling-contrib-1.7/ws/trunk/extensions/distribution/extensions/src/main/java/org/apache/sling/distribution/serialization/impl/avro/AvroDistributionPackageBuilderFactory.java>:[116,114]
cannot find symbol
[ERROR] symbol:   class DistributionException
[ERROR] location: class org.apache.sling.distribution.serialization.impl.avro.AvroDistributionPackageBuilderFactory
[ERROR] <https://builds.apache.org/job/sling-contrib-1.7/ws/trunk/extensions/distribution/extensions/src/main/java/org/apache/sling/distribution/serialization/impl/avro/AvroDistributionPackageBuilderFactory.java>:[120,88]
cannot find symbol
[ERROR] symbol:   class DistributionPackage
[ERROR] location: class org.apache.sling.distribution.serialization.impl.avro.AvroDistributionPackageBuilderFactory
[ERROR] <https://builds.apache.org/job/sling-contrib-1.7/ws/trunk/extensions/distribution/extensions/src/main/java/org/apache/sling/distribution/serialization/impl/avro/AvroDistributionPackageBuilderFactory.java>:[120,136]
cannot find symbol
[ERROR] symbol:   class DistributionException
[ERROR] location: class org.apache.sling.distribution.serialization.impl.avro.AvroDistributionPackageBuilderFactory
[ERROR] <https://builds.apache.org/job/sling-contrib-1.7/ws/trunk/extensions/distribution/extensions/src/main/java/org/apache/sling/distribution/serialization/impl/kryo/KryoDistributionPackageBuilderFactory.java>:[51,10]
cannot find symbol
[ERROR] symbol: class DistributionPackageBuilder
[ERROR] <https://builds.apache.org/job/sling-contrib-1.7/ws/trunk/extensions/distribution/extensions/src/main/java/org/apache/sling/distribution/serialization/impl/avro/AvroDistributionPackageBuilderFactory.java>:[51,10]
cannot find symbol
[ERROR] symbol: class DistributionPackageBuilder
[ERROR] <https://builds.apache.org/job/sling-contrib-1.7/ws/trunk/extensions/distribution/extensions/src/main/java/org/apache/sling/distribution/serialization/impl/FileDistributionPackage.java>:[40,25]
cannot find symbol
[ERROR] symbol:   class DistributionPackageInfo
[ERROR] location: class org.apache.sling.distribution.serialization.impl.FileDistributionPackage
[ERROR] <https://builds.apache.org/job/sling-contrib-1.7/ws/trunk/extensions/distribution/extensions/src/main/java/org/apache/sling/distribution/serialization/impl/FileDistributionPackage.java>:[69,5]
method does not override or implement a method from a supertype
[ERROR] <https://builds.apache.org/job/sling-contrib-1.7/ws/trunk/extensions/distribution/extensions/src/main/java/org/apache/sling/distribution/serialization/impl/kryo/KryoResourceDistributionPackageBuilder.java>:[97,9]
cannot find symbol
[ERROR] symbol:   class DistributionPackage
[ERROR] location: class org.apache.sling.distribution.serialization.impl.kryo.KryoResourceDistributionPackageBuilder
[ERROR] <https://builds.apache.org/job/sling-contrib-1.7/ws/trunk/extensions/distribution/extensions/src/main/java/org/apache/sling/distribution/serialization/impl/kryo/KryoResourceDistributionPackageBuilder.java>:[114,23]
cannot find symbol
[ERROR] symbol:   class DistributionException
[ERROR] location: class org.apache.sling.distribution.serialization.impl.kryo.KryoResourceDistributionPackageBuilder
[ERROR] <https://builds.apache.org/job/sling-contrib-1.7/ws/trunk/extensions/distribution/extensions/src/main/java/org/apache/sling/distribution/serialization/impl/kryo/KryoResourceDistributionPackageBuilder.java>:[139,23]
cannot find symbol
[ERROR] symbol:   class DistributionException
[ERROR] location: class org.apache.sling.distribution.serialization.impl.kryo.KryoResourceDistributionPackageBuilder
[ERROR] <https://builds.apache.org/job/sling-contrib-1.7/ws/trunk/extensions/distribution/extensions/src/main/java/org/apache/sling/distribution/serialization/impl/kryo/KryoResourceDistributionPackageBuilder.java>:[163,23]
cannot find symbol
[ERROR] symbol:   class DistributionException
[ERROR] location: class org.apache.sling.distribution.serialization.impl.kryo.KryoResourceDistributionPackageBuilder
[ERROR] <https://builds.apache.org/job/sling-contrib-1.7/ws/trunk/extensions/distribution/extensions/src/main/java/org/apache/sling/distribution/serialization/impl/avro/AvroDistributionPackageBuilder.java>:[105,5]
method does not override or implement a method from a supertype
[ERROR] <https://builds.apache.org/job/sling-contrib-1.7/ws/trunk/extensions/distribution/extensions/src/main/java/org/apache/sling/distribution/serialization/impl/avro/AvroDistributionPackageBuilder.java>:[113,9]
cannot find symbol
[ERROR] symbol:   class DistributionPackage
[ERROR] location: class org.apache.sling.distribution.serialization.impl.avro.AvroDistributionPackageBuilder
[ERROR] <https://builds.apache.org/job/sling-contrib-1.7/ws/trunk/extensions/distribution/extensions/src/main/java/org/apache/sling/distribution/serialization/impl/avro/AvroDistributionPackageBuilder.java>:[128,23]
cannot find symbol
[ERROR] symbol:   class DistributionException
[ERROR] location: class org.apache.sling.distribution.serialization.impl.avro.AvroDistributionPackageBuilder
[ERROR] <https://builds.apache.org/job/sling-contrib-1.7/ws/trunk/extensions/distribution/extensions/src/main/java/org/apache/sling/distribution/serialization/impl/avro/AvroDistributionPackageBuilder.java>:[111,5]
method does not override or implement a method from a supertype
[ERROR] <https://builds.apache.org/job/sling-contrib-1.7/ws/trunk/extensions/distribution/extensions/src/main/java/org/apache/sling/distribution/serialization/impl/avro/AvroDistributionPackageBuilder.java>:[186,23]
cannot find symbol
[ERROR] symbol:   class DistributionException
[ERROR] location: class org.apache.sling.distribution.serialization.impl.avro.AvroDistributionPackageBuilder
[ERROR] <https://builds.apache.org/job/sling-contrib-1.7/ws/trunk/extensions/distribution/extensions/src/main/java/org/apache/sling/distribution/serialization/impl/avro/AvroDistributionPackageBuilder.java>:[175,5]
method does not override or implement a method from a supertype
[ERROR] <https://builds.apache.org/job/sling-contrib-1.7/ws/trunk/extensions/distribution/extensions/src/main/java/org/apache/sling/distribution/serialization/impl/avro/AvroDistributionPackageBuilder.java>:[206,5]
method does not override or implement a method from a supertype
[ERROR] <https://builds.apache.org/job/sling-contrib-1.7/ws/trunk/extensions/distribution/extensions/src/main/java/org/apache/sling/distribution/serialization/impl/avro/AvroDistributionPackageBuilder.java>:[228,27]
cannot find symbol
[ERROR] symbol:   class DistributionException
[ERROR] location: class org.apache.sling.distribution.serialization.impl.avro.AvroDistributionPackageBuilder
[ERROR] <https://builds.apache.org/job/sling-contrib-1.7/ws/trunk/extensions/distribution/extensions/src/main/java/org/apache/sling/distribution/serialization/impl/avro/AvroDistributionPackageBuilder.java>:[216,5]
method does not override or implement a method from a supertype
[ERROR] -> [Help 1]
[ERROR] 
[ERROR] To see the full stack trace of the errors, re-run Maven with the -e switch.
[ERROR] Re-run Maven using the -X switch to enable full debug logging.
[ERROR] 
[ERROR] For more information about the errors and possible solutions, please read the following
articles:
[ERROR] [Help 1] http://cwiki.apache.org/confluence/display/MAVEN/MojoFailureException
[ERROR] 
[ERROR] After correcting the problems, you can resume the build with the command
[ERROR]   mvn <goals> -rf :org.apache.sling.distribution.extensions
channel stopped

Mime
View raw message