sling-commits mailing list archives

Site index · List index
Message view « Date » · « Thread »
Top « Date » · « Thread »
From Apache Jenkins Server <jenk...@builds.apache.org>
Subject Build failed in Jenkins: sling-trunk-1.7 #2664
Date Thu, 05 Nov 2015 12:50:16 GMT
See <https://builds.apache.org/job/sling-trunk-1.7/2664/changes>

Changes:

[stefanegli] SLING-5267 : fixed testTwoNodesOneLeaving by making wait times safer, asserting
for background-runnable done-state, plus added more logging in case this one is still not
perfectly stable on jenkins

------------------------------------------
[...truncated 702941 lines...]
[INFO] Apache Sling Scripting JavaScript Support ......... SUCCESS [16.481s]
[INFO] Apache Sling Scripting JSP Support ................ SUCCESS [12.335s]
[INFO] Apache Sling JSP Tag Library ...................... SUCCESS [7.959s]
[INFO] Apache Sling JSP Standard Tag Library ............. SUCCESS [4.951s]
[INFO] Apache Sling Scripting Sightly Engine ............. SUCCESS [15.369s]
[INFO] Apache Sling Scripting Sightly JavaScript Use Provider  SUCCESS [7.101s]
[INFO] Apache Sling Scripting Sightly Models Use Provider  SUCCESS [7.376s]
[INFO] Apache Sling Scripting Sightly Read-Eval-Print Loop Environment  SUCCESS [3.959s]
[INFO] Apache Sling Scripting Sightly Integration Tests Content  SUCCESS [6.950s]
[INFO] Apache Sling Filesystem Resource Provider ......... SUCCESS [5.084s]
[INFO] Apache Sling Installer WebConsole Plugin .......... SUCCESS [4.209s]
[INFO] Apache Sling Models API ........................... SUCCESS [3.977s]
[INFO] Apache Sling Models Implementation ................ SUCCESS [10.947s]
[INFO] Apache Sling Scripting Sightly Integration Tests .. SUCCESS [3:11.453s]
[INFO] Apache Sling Scripting Sightly Reactor ............ SUCCESS [3.875s]
[INFO] Apache Sling Adapter Manager Implementation ....... SUCCESS [5.320s]
[INFO] Apache Sling Bundle Resource Provider ............. SUCCESS [5.173s]
[INFO] Apache Sling Distributed Event Admin .............. SUCCESS [4.487s]
[INFO] Apache Sling Discovery API ........................ SUCCESS [4.328s]
[INFO] Apache Sling Discovery Commons .................... SUCCESS [1:48.450s]
[INFO] Apache Sling Discovery Base ....................... SUCCESS [1:06.004s]
[INFO] Apache Sling Resource-Based Discovery Service ..... SUCCESS [16:54.339s]
[INFO] Apache Sling Oak-Based Discovery Service .......... SUCCESS [10:19.176s]
[INFO] Apache Sling Discovery Support Bundle ............. SUCCESS [5.447s]
[INFO] Apache Sling Discovery Standalone Implementation .. SUCCESS [4.769s]
[INFO] Apache Sling Event Support ........................ SUCCESS [10:22.622s]
[INFO] Apache Sling Feature Flags ........................ SUCCESS [4.775s]
[INFO] Apache Sling javax.activation bundle .............. SUCCESS [5.831s]
[INFO] Apache Sling Service User Mapper .................. SUCCESS [8.239s]
[INFO] Apache Sling Settings ............................. SUCCESS [4.843s]
[INFO] Apache Sling Web Console Branding ................. SUCCESS [5.083s]
[INFO] Apache Sling Web Console Security Provider ........ SUCCESS [4.580s]
[INFO] Apache Sling Explorer ............................. SUCCESS [4.802s]
[INFO] Apache Sling Health Check Core .................... SUCCESS [12.281s]
[INFO] Apache Sling Health Check Annotations ............. SUCCESS [3.361s]
[INFO] Apache Sling Health Check Samples ................. SUCCESS [4.890s]
[INFO] Apache Sling Health Check Support Components ...... SUCCESS [5.287s]
[INFO] Apache Sling Health Check Webconsole Plugin ....... SUCCESS [3.917s]
[INFO] Apache Sling Health Check JUnit Bridge ............ SUCCESS [5.365s]
[INFO] Apache Sling Health Check Integration Tests ....... SUCCESS [28.351s]
[INFO] Apache Sling Health Check Reactor POM ............. SUCCESS [2.747s]
[INFO] Apache Sling Resource Access Security ............. SUCCESS [4.111s]
[INFO] Apache Sling Test Tools ........................... SUCCESS [6.340s]
[INFO] Apache Sling Resource Access Security Integration Tests  FAILURE [5:05.660s]
[INFO] Apache Sling Validation Framework API ............. SKIPPED
[INFO] Apache Sling Validation Framework Core Implementation  SKIPPED
[INFO] Apache Sling Validation Framework Testing Services  SKIPPED
[INFO] Apache Sling Validation Framework Integration Tests  SKIPPED
[INFO] Apache Sling Validation Framework Examples ........ SKIPPED
[INFO] Apache Sling Validation Framework Builder ......... SKIPPED
[INFO] Apache Sling Models Validation Implementation ..... SKIPPED
[INFO] Apache Sling Models Integration Tests ............. SKIPPED
[INFO] Apache Sling Internationalization Support ......... SKIPPED
[INFO] Apache Sling XSS Protection Bundle ................ SKIPPED
[INFO] Apache Sling Testing Hamcrest ..................... SKIPPED
[INFO] Apache Sling JUnit Core ........................... SKIPPED
[INFO] Apache Sling JUnit Scriptable Tests Provider ...... SKIPPED
[INFO] Apache Sling JUnit Health Checks .................. SKIPPED
[INFO] Apache Sling JUnit Remote Tests Runners ........... SKIPPED
[INFO] Apache Sling JUnit Performance .................... SKIPPED
[INFO] Apache Sling JUnit Tests Teleporter ............... SKIPPED
[INFO] Apache Sling Testing Mock Log Configuration ....... SKIPPED
[INFO] Apache Sling Testing Resource Resolver Mock ....... SKIPPED
[INFO] Apache Sling Testing JCR Mock ..................... SKIPPED
[INFO] Apache Sling Testing OSGi Mock .................... SKIPPED
[INFO] Apache Sling Testing Sling Mock ................... SKIPPED
[INFO] Apache Sling Testing Sling Mock Jackrabbit-based Resource Resolver  SKIPPED
[INFO] Apache Sling Testing Sling Mock Oak-based Resource Resolver  SKIPPED
[INFO] Apache Sling Sample Server-Side Tests ............. SKIPPED
[INFO] Apache Sling Failing Server-Side Tests ............ SKIPPED
[INFO] Apache Sling Sample Integration Tests ............. SKIPPED
[INFO] Apache Sling Testing Modules Reactor .............. SKIPPED
[INFO] Apache Sling Installer ............................ SKIPPED
[INFO] Apache Sling File Installer ....................... SKIPPED
[INFO] Apache Sling JCR Installer ........................ SKIPPED
[INFO] Apache Sling Installer Configuration Admin Support  SKIPPED
[INFO] Apache Sling Deployment Package Installer ......... SKIPPED
[INFO] Apache Sling Subsystems Installer ................. SKIPPED
[INFO] Apache Sling Installer Integration Tests .......... SKIPPED
[INFO] Apache Sling Launchpad API ........................ SKIPPED
[INFO] Apache Sling Launchpad Base ....................... SKIPPED
[INFO] Apache Sling Launchpad Installer .................. SKIPPED
[INFO] Apache Sling Launchpad Content .................... SKIPPED
[INFO] Apache Sling Launchpad Application Builder ........ SKIPPED
[INFO] Apache Sling Launchpad Testing Services ........... SKIPPED
[INFO] Apache Sling Launchpad Testing Services WAR ....... SKIPPED
[INFO] Apache Sling Launchpad Testing Fragment Bundle .... SKIPPED
[INFO] Apache Sling Launchpad Test Bundles ............... SKIPPED
[INFO] Apache Sling Integration Tests .................... SKIPPED
[INFO] Apache Sling Launchpad Testing .................... SKIPPED
[INFO] Apache Sling (Builder) ............................ SKIPPED
[INFO] ------------------------------------------------------------------------
[INFO] BUILD FAILURE
[INFO] ------------------------------------------------------------------------
[INFO] Total time: 1:07:42.970s
[INFO] Finished at: Thu Nov 05 12:44:48 UTC 2015
[INFO] Final Memory: 153M/292M
[INFO] ------------------------------------------------------------------------
[JENKINS] Archiving disabled
[JENKINS] Archiving disabled
[JENKINS] Archiving disabled
[JENKINS] Archiving disabled
[JENKINS] Archiving disabled
[JENKINS] Archiving disabled
[JENKINS] Archiving disabled
[JENKINS] Archiving disabled
[JENKINS] Archiving disabled
[JENKINS] Archiving disabled
[JENKINS] Archiving disabled
[JENKINS] Archiving disabled
[JENKINS] Archiving disabled
[JENKINS] Archiving disabled
[JENKINS] Archiving disabled
[JENKINS] Archiving disabled
[JENKINS] Archiving disabled
[JENKINS] Archiving disabled
[JENKINS] Archiving disabled
[JENKINS] Archiving disabled
[JENKINS] Archiving disabled
[JENKINS] Archiving disabled
[JENKINS] Archiving disabled
[JENKINS] Archiving disabled
[JENKINS] Archiving disabled
[JENKINS] Archiving disabled
[JENKINS] Archiving disabled
[JENKINS] Archiving disabled
[JENKINS] Archiving disabled
[JENKINS] Archiving disabled
[JENKINS] Archiving disabled
[JENKINS] Archiving disabled
[JENKINS] Archiving disabled
[JENKINS] Archiving disabled
[JENKINS] Archiving disabled
[JENKINS] Archiving disabled
[JENKINS] Archiving disabled
[JENKINS] Archiving disabled
[JENKINS] Archiving disabled
[JENKINS] Archiving disabled
[JENKINS] Archiving disabled
[JENKINS] Archiving disabled
[JENKINS] Archiving disabled
[JENKINS] Archiving disabled
[JENKINS] Archiving disabled
[JENKINS] Archiving disabled
[JENKINS] Archiving disabled
[JENKINS] Archiving disabled
[JENKINS] Archiving disabled
[JENKINS] Archiving disabled
[JENKINS] Archiving disabled
[JENKINS] Archiving disabled
[JENKINS] Archiving disabled
[JENKINS] Archiving disabled
[JENKINS] Archiving disabled
[JENKINS] Archiving disabled
[JENKINS] Archiving disabled
[JENKINS] Archiving disabled
[JENKINS] Archiving disabled
[JENKINS] Archiving disabled
[JENKINS] Archiving disabled
[JENKINS] Archiving disabled
[JENKINS] Archiving disabled
[JENKINS] Archiving disabled
[JENKINS] Archiving disabled
[JENKINS] Archiving disabled
[JENKINS] Archiving disabled
[JENKINS] Archiving disabled
[JENKINS] Archiving disabled
[JENKINS] Archiving disabled
[JENKINS] Archiving disabled
[JENKINS] Archiving disabled
[JENKINS] Archiving disabled
[JENKINS] Archiving disabled
[JENKINS] Archiving disabled
[JENKINS] Archiving disabled
[JENKINS] Archiving disabled
[JENKINS] Archiving disabled
[JENKINS] Archiving disabled
[JENKINS] Archiving disabled
[JENKINS] Archiving disabled
[JENKINS] Archiving disabled
[JENKINS] Archiving disabled
[JENKINS] Archiving disabled
[JENKINS] Archiving disabled
[JENKINS] Archiving disabled
[JENKINS] Archiving disabled
[JENKINS] Archiving disabled
[JENKINS] Archiving disabled
[JENKINS] Archiving disabled
[JENKINS] Archiving disabled
[JENKINS] Archiving disabled
[JENKINS] Archiving disabled
[JENKINS] Archiving disabled
[JENKINS] Archiving disabled
[JENKINS] Archiving disabled
[JENKINS] Archiving disabled
[JENKINS] Archiving disabled
[JENKINS] Archiving disabled
[JENKINS] Archiving disabled
[JENKINS] Archiving disabled
[JENKINS] Archiving disabled
[JENKINS] Archiving disabled
[JENKINS] Archiving disabled
[JENKINS] Archiving disabled
[JENKINS] Archiving disabled
[JENKINS] Archiving disabled
[JENKINS] Archiving disabled
[JENKINS] Archiving disabled
[JENKINS] Archiving disabled
[JENKINS] Archiving disabled
[JENKINS] Archiving disabled
[JENKINS] Archiving disabled
[JENKINS] Archiving disabled
[JENKINS] Archiving disabled
[JENKINS] Archiving disabled
[JENKINS] Archiving disabled
[JENKINS] Archiving disabled
[JENKINS] Archiving disabled
[JENKINS] Archiving disabled
[JENKINS] Archiving disabled
[JENKINS] Archiving disabled
[JENKINS] Archiving disabled
[JENKINS] Archiving disabled
[JENKINS] Archiving disabled
[JENKINS] Archiving disabled
[JENKINS] Archiving disabled
[JENKINS] Archiving disabled
[JENKINS] Archiving disabled
[JENKINS] Archiving disabled
[JENKINS] Archiving disabled
[JENKINS] Archiving disabled
[JENKINS] Archiving disabled
[JENKINS] Archiving disabled
[JENKINS] Archiving disabled
[JENKINS] Archiving disabled
[JENKINS] Archiving disabled
[JENKINS] Archiving disabled
[JENKINS] Archiving disabled
Waiting for Jenkins to finish collecting data
[ERROR] Failed to execute goal org.apache.rat:apache-rat-plugin:0.11:check (default) on project
org.apache.sling.resourceaccesssecurity.it: Too many files with unapproved license: 1 See
RAT report in: <https://builds.apache.org/job/sling-trunk-1.7/ws/trunk/bundles/resourceaccesssecurity/it/target/rat.txt>
-> [Help 1]
[ERROR] 
[ERROR] To see the full stack trace of the errors, re-run Maven with the -e switch.
[ERROR] Re-run Maven using the -X switch to enable full debug logging.
[ERROR] 
[ERROR] For more information about the errors and possible solutions, please read the following
articles:
[ERROR] [Help 1] http://cwiki.apache.org/confluence/display/MAVEN/MojoFailureException
[ERROR] 
[ERROR] After correcting the problems, you can resume the build with the command
[ERROR]   mvn <goals> -rf :org.apache.sling.resourceaccesssecurity.it
channel stopped

Mime
View raw message