sling-commits mailing list archives

Site index · List index
Message view « Date » · « Thread »
Top « Date » · « Thread »
From Apache Jenkins Server <jenk...@builds.apache.org>
Subject Build failed in Jenkins: sling-trunk-1.8 #1818
Date Wed, 21 Oct 2015 07:19:54 GMT
See <https://builds.apache.org/job/sling-trunk-1.8/1818/>

------------------------------------------
[...truncated 41478 lines...]
[INFO] Apache Sling Default POST Servlets ................ SUCCESS [3.903s]
[INFO] Apache Sling Compat Servlets ...................... SUCCESS [1.909s]
[INFO] Apache Sling Scripting Implementation API ......... SUCCESS [1.980s]
[INFO] Apache Sling Scripting Core implementation ........ SUCCESS [15.003s]
[INFO] Apache Sling Scripting JavaScript Support ......... SUCCESS [35.497s]
[INFO] Apache Sling Scripting JSP Support ................ SUCCESS [5.304s]
[INFO] Apache Sling JSP Tag Library ...................... SUCCESS [4.621s]
[INFO] Apache Sling JSP Standard Tag Library ............. SUCCESS [1.983s]
[INFO] Apache Sling Scripting Sightly Engine ............. SUCCESS [9.409s]
[INFO] Apache Sling Scripting Sightly JavaScript Use Provider  SUCCESS [2.234s]
[INFO] Apache Sling Scripting Sightly Models Use Provider  SUCCESS [1.956s]
[INFO] Apache Sling Scripting Sightly Read-Eval-Print Loop Environment  SUCCESS [1.986s]
[INFO] Apache Sling Scripting Sightly Integration Tests Content  SUCCESS [3.124s]
[INFO] Apache Sling Scripting Sightly Integration Tests .. SUCCESS [2:42.992s]
[INFO] Apache Sling Scripting Sightly Reactor ............ SUCCESS [1.218s]
[INFO] Apache Sling Adapter Manager Implementation ....... SUCCESS [5.028s]
[INFO] Apache Sling Bundle Resource Provider ............. SUCCESS [1.794s]
[INFO] Apache Sling Distributed Event Admin .............. SUCCESS [2.656s]
[INFO] Apache Sling Discovery API ........................ SUCCESS [1.839s]
[INFO] Apache Sling Discovery Commons .................... SUCCESS [45.875s]
[INFO] Apache Sling Resource-Based Discovery Service ..... FAILURE [0.650s]
[INFO] Apache Sling Discovery Support Bundle ............. SKIPPED
[INFO] Apache Sling Discovery Standalone Implementation .. SKIPPED
[INFO] Apache Sling Event Support ........................ SKIPPED
[INFO] Apache Sling Feature Flags ........................ SKIPPED
[INFO] Apache Sling Filesystem Resource Provider ......... SKIPPED
[INFO] Apache Sling javax.activation bundle .............. SKIPPED
[INFO] Apache Sling Service User Mapper .................. SKIPPED
[INFO] Apache Sling Settings ............................. SKIPPED
[INFO] Apache Sling Web Console Branding ................. SKIPPED
[INFO] Apache Sling Web Console Security Provider ........ SKIPPED
[INFO] Apache Sling Explorer ............................. SKIPPED
[INFO] Apache Sling Health Check Core .................... SKIPPED
[INFO] Apache Sling Health Check Annotations ............. SKIPPED
[INFO] Apache Sling Health Check Samples ................. SKIPPED
[INFO] Apache Sling Health Check Support Components ...... SKIPPED
[INFO] Apache Sling Health Check Webconsole Plugin ....... SKIPPED
[INFO] Apache Sling Health Check JUnit Bridge ............ SKIPPED
[INFO] Apache Sling Health Check Integration Tests ....... SKIPPED
[INFO] Apache Sling Health Check Reactor POM ............. SKIPPED
[INFO] Apache Sling Resource Access Security ............. SKIPPED
[INFO] Apache Sling Test Tools ........................... SKIPPED
[INFO] Apache Sling Resource Access Security Integration Tests  SKIPPED
[INFO] Apache Sling Validation Framework API ............. SKIPPED
[INFO] Apache Sling Validation Framework Core Implementation  SKIPPED
[INFO] Apache Sling Validation Framework Testing Services  SKIPPED
[INFO] Apache Sling Validation Framework Integration Tests  SKIPPED
[INFO] Apache Sling Validation Framework Examples ........ SKIPPED
[INFO] Apache Sling Validation Framework Builder ......... SKIPPED
[INFO] Apache Sling Models API ........................... SKIPPED
[INFO] Apache Sling Models Implementation ................ SKIPPED
[INFO] Apache Sling Models Validation Implementation ..... SKIPPED
[INFO] Apache Sling Models Integration Tests ............. SKIPPED
[INFO] Apache Sling Internationalization Support ......... SKIPPED
[INFO] Apache Sling XSS Protection Bundle ................ SKIPPED
[INFO] Apache Sling Testing Hamcrest ..................... SKIPPED
[INFO] Apache Sling JUnit Core ........................... SKIPPED
[INFO] Apache Sling JUnit Scriptable Tests Provider ...... SKIPPED
[INFO] Apache Sling JUnit Health Checks .................. SKIPPED
[INFO] Apache Sling JUnit Remote Tests Runners ........... SKIPPED
[INFO] Apache Sling JUnit Performance .................... SKIPPED
[INFO] Apache Sling JUnit Tests Teleporter ............... SKIPPED
[INFO] Apache Sling Testing Mock Log Configuration ....... SKIPPED
[INFO] Apache Sling Testing Resource Resolver Mock ....... SKIPPED
[INFO] Apache Sling Testing JCR Mock ..................... SKIPPED
[INFO] Apache Sling Testing OSGi Mock .................... SKIPPED
[INFO] Apache Sling Testing Sling Mock ................... SKIPPED
[INFO] Apache Sling Testing Sling Mock Jackrabbit-based Resource Resolver  SKIPPED
[INFO] Apache Sling Testing Sling Mock Oak-based Resource Resolver  SKIPPED
[INFO] Apache Sling Sample Server-Side Tests ............. SKIPPED
[INFO] Apache Sling Failing Server-Side Tests ............ SKIPPED
[INFO] Apache Sling Sample Integration Tests ............. SKIPPED
[INFO] Apache Sling Testing Modules Reactor .............. SKIPPED
[INFO] Apache Sling Installer ............................ SKIPPED
[INFO] Apache Sling Installer WebConsole Plugin .......... SKIPPED
[INFO] Apache Sling File Installer ....................... SKIPPED
[INFO] Apache Sling JCR Installer ........................ SKIPPED
[INFO] Apache Sling Installer Configuration Admin Support  SKIPPED
[INFO] Apache Sling Deployment Package Installer ......... SKIPPED
[INFO] Apache Sling Subsystems Installer ................. SKIPPED
[INFO] Apache Sling Installer Integration Tests .......... SKIPPED
[INFO] Apache Sling Launchpad API ........................ SKIPPED
[INFO] Apache Sling Launchpad Base ....................... SKIPPED
[INFO] Apache Sling Launchpad Installer .................. SKIPPED
[INFO] Apache Sling Launchpad Content .................... SKIPPED
[INFO] Apache Sling Launchpad Application Builder ........ SKIPPED
[INFO] Apache Sling Launchpad Testing Services ........... SKIPPED
[INFO] Apache Sling Launchpad Testing Services WAR ....... SKIPPED
[INFO] Apache Sling Launchpad Testing Fragment Bundle .... SKIPPED
[INFO] Apache Sling Launchpad Test Bundles ............... SKIPPED
[INFO] Apache Sling Integration Tests .................... SKIPPED
[INFO] Apache Sling Launchpad Testing .................... SKIPPED
[INFO] Apache Sling (Builder) ............................ SKIPPED
[INFO] ------------------------------------------------------------------------
[INFO] BUILD FAILURE
[INFO] ------------------------------------------------------------------------
[INFO] Total time: 16:10.941s
[INFO] Finished at: Wed Oct 21 07:20:12 UTC 2015
[INFO] Final Memory: 151M/460M
[INFO] ------------------------------------------------------------------------
[JENKINS] Archiving disabled
[JENKINS] Archiving disabled
[JENKINS] Archiving disabled
[JENKINS] Archiving disabled
[JENKINS] Archiving disabled
[JENKINS] Archiving disabled
[JENKINS] Archiving disabled
[JENKINS] Archiving disabled
[JENKINS] Archiving disabled
[JENKINS] Archiving disabled
[JENKINS] Archiving disabled
[JENKINS] Archiving disabled
[JENKINS] Archiving disabled
[JENKINS] Archiving disabled
[JENKINS] Archiving disabled
[JENKINS] Archiving disabled
[JENKINS] Archiving disabled
[JENKINS] Archiving disabled
[JENKINS] Archiving disabled
[JENKINS] Archiving disabled
[JENKINS] Archiving disabled
[JENKINS] Archiving disabled
[JENKINS] Archiving disabled
[JENKINS] Archiving disabled
[JENKINS] Archiving disabled
[JENKINS] Archiving disabled
[JENKINS] Archiving disabled
[JENKINS] Archiving disabled
[JENKINS] Archiving disabled
[JENKINS] Archiving disabled
[JENKINS] Archiving disabled
[JENKINS] Archiving disabled
[JENKINS] Archiving disabled
[JENKINS] Archiving disabled
[JENKINS] Archiving disabled
[JENKINS] Archiving disabled
[JENKINS] Archiving disabled
[JENKINS] Archiving disabled
[JENKINS] Archiving disabled
[JENKINS] Archiving disabled
[JENKINS] Archiving disabled
[JENKINS] Archiving disabled
[JENKINS] Archiving disabled
[JENKINS] Archiving disabled
[JENKINS] Archiving disabled
[JENKINS] Archiving disabled
[JENKINS] Archiving disabled
[JENKINS] Archiving disabled
[JENKINS] Archiving disabled
[JENKINS] Archiving disabled
[JENKINS] Archiving disabled
[JENKINS] Archiving disabled
[JENKINS] Archiving disabled
[JENKINS] Archiving disabled
[JENKINS] Archiving disabled
[JENKINS] Archiving disabled
[JENKINS] Archiving disabled
[JENKINS] Archiving disabled
[JENKINS] Archiving disabled
[JENKINS] Archiving disabled
[JENKINS] Archiving disabled
[JENKINS] Archiving disabled
[JENKINS] Archiving disabled
[JENKINS] Archiving disabled
[JENKINS] Archiving disabled
[JENKINS] Archiving disabled
[JENKINS] Archiving disabled
[JENKINS] Archiving disabled
[JENKINS] Archiving disabled
[JENKINS] Archiving disabled
[JENKINS] Archiving disabled
[JENKINS] Archiving disabled
[JENKINS] Archiving disabled
[JENKINS] Archiving disabled
[JENKINS] Archiving disabled
[JENKINS] Archiving disabled
[JENKINS] Archiving disabled
[JENKINS] Archiving disabled
[JENKINS] Archiving disabled
[JENKINS] Archiving disabled
[JENKINS] Archiving disabled
[JENKINS] Archiving disabled
[JENKINS] Archiving disabled
[JENKINS] Archiving disabled
[JENKINS] Archiving disabled
[JENKINS] Archiving disabled
[JENKINS] Archiving disabled
[JENKINS] Archiving disabled
[JENKINS] Archiving disabled
[JENKINS] Archiving disabled
[JENKINS] Archiving disabled
[JENKINS] Archiving disabled
[JENKINS] Archiving disabled
[JENKINS] Archiving disabled
[JENKINS] Archiving disabled
[JENKINS] Archiving disabled
[JENKINS] Archiving disabled
[JENKINS] Archiving disabled
[JENKINS] Archiving disabled
[JENKINS] Archiving disabled
[JENKINS] Archiving disabled
[JENKINS] Archiving disabled
[JENKINS] Archiving disabled
[JENKINS] Archiving disabled
[JENKINS] Archiving disabled
[JENKINS] Archiving disabled
[JENKINS] Archiving disabled
[JENKINS] Archiving disabled
[JENKINS] Archiving disabled
[JENKINS] Archiving disabled
[JENKINS] Archiving disabled
[JENKINS] Archiving disabled
[JENKINS] Archiving disabled
[JENKINS] Archiving disabled
[JENKINS] Archiving disabled
[JENKINS] Archiving disabled
[JENKINS] Archiving disabled
[JENKINS] Archiving disabled
[JENKINS] Archiving disabled
[JENKINS] Archiving disabled
[JENKINS] Archiving disabled
[JENKINS] Archiving disabled
[JENKINS] Archiving disabled
[JENKINS] Archiving disabled
[JENKINS] Archiving disabled
[JENKINS] Archiving disabled
[JENKINS] Archiving disabled
[JENKINS] Archiving disabled
[JENKINS] Archiving disabled
[JENKINS] Archiving disabled
[JENKINS] Archiving disabled
[JENKINS] Archiving disabled
[JENKINS] Archiving disabled
[JENKINS] Archiving disabled
[JENKINS] Archiving disabled
[JENKINS] Archiving disabled
[JENKINS] Archiving disabled
Waiting for Jenkins to finish collecting data[ERROR] Failed to execute goal on project org.apache.sling.discovery.impl:
Could not resolve dependencies for project org.apache.sling:org.apache.sling.discovery.impl:bundle:1.1.9-SNAPSHOT:
The following artifacts could not be resolved: org.apache.sling:org.apache.sling.discovery.base:jar:1.0.0-SNAPSHOT,
org.apache.sling:org.apache.sling.discovery.base:jar:tests:1.0.0-SNAPSHOT: Could not find
artifact org.apache.sling:org.apache.sling.discovery.base:jar:1.0.0-SNAPSHOT in Nexus (http://repository.apache.org/snapshots)
-> [Help 1]
[ERROR] 
[ERROR] To see the full stack trace of the errors, re-run Maven with the -e switch.
[ERROR] Re-run Maven using the -X switch to enable full debug logging.
[ERROR] 
[ERROR] For more information about the errors and possible solutions, please read the following
articles:
[ERROR] [Help 1] http://cwiki.apache.org/confluence/display/MAVEN/DependencyResolutionException
[ERROR] 
[ERROR] After correcting the problems, you can resume the build with the command
[ERROR]   mvn <goals> -rf :org.apache.sling.discovery.impl

channel stopped

Mime
View raw message