sling-commits mailing list archives

Site index · List index
Message view « Date » · « Thread »
Top « Date » · « Thread »
From Apache Jenkins Server <jenk...@builds.apache.org>
Subject Build failed in Jenkins: sling-trunk-1.7 #2527
Date Mon, 19 Oct 2015 20:07:06 GMT
See <https://builds.apache.org/job/sling-trunk-1.7/2527/>

------------------------------------------
[...truncated 121799 lines...]
[INFO] Apache Sling Default POST Servlets ................ SUCCESS [6.971s]
[INFO] Apache Sling Compat Servlets ...................... SUCCESS [4.055s]
[INFO] Apache Sling Scripting Implementation API ......... SUCCESS [4.169s]
[INFO] Apache Sling Scripting Core implementation ........ SUCCESS [16.931s]
[INFO] Apache Sling Scripting JavaScript Support ......... SUCCESS [35.775s]
[INFO] Apache Sling Scripting JSP Support ................ SUCCESS [8.469s]
[INFO] Apache Sling JSP Tag Library ...................... SUCCESS [8.671s]
[INFO] Apache Sling JSP Standard Tag Library ............. SUCCESS [4.293s]
[INFO] Apache Sling Scripting Sightly Engine ............. SUCCESS [12.563s]
[INFO] Apache Sling Scripting Sightly JavaScript Use Provider  SUCCESS [6.131s]
[INFO] Apache Sling Scripting Sightly Models Use Provider  SUCCESS [4.025s]
[INFO] Apache Sling Scripting Sightly Read-Eval-Print Loop Environment  SUCCESS [5.916s]
[INFO] Apache Sling Scripting Sightly Integration Tests Content  SUCCESS [8.925s]
[INFO] Apache Sling Scripting Sightly Integration Tests .. SUCCESS [3:21.141s]
[INFO] Apache Sling Scripting Sightly Reactor ............ SUCCESS [3.020s]
[INFO] Apache Sling Adapter Manager Implementation ....... SUCCESS [6.365s]
[INFO] Apache Sling Bundle Resource Provider ............. SUCCESS [5.058s]
[INFO] Apache Sling Distributed Event Admin .............. SUCCESS [6.719s]
[INFO] Apache Sling Discovery API ........................ SUCCESS [5.179s]
[INFO] Apache Sling Discovery Commons Bundle ............. SUCCESS [1:46.536s]
[INFO] Apache Sling Resource-Based Discovery Service ..... SUCCESS [24:03.740s]
[INFO] Apache Sling Discovery Support Bundle ............. SUCCESS [4.287s]
[INFO] Apache Sling Discovery Standalone Implementation .. SUCCESS [3.913s]
[INFO] Apache Sling Event Support ........................ SUCCESS [20:35.517s]
[INFO] Apache Sling Feature Flags ........................ SUCCESS [4.513s]
[INFO] Apache Sling Filesystem Resource Provider ......... SUCCESS [6.225s]
[INFO] Apache Sling javax.activation bundle .............. SUCCESS [7.027s]
[INFO] Apache Sling Service User Mapper .................. SUCCESS [6.956s]
[INFO] Apache Sling Settings ............................. SUCCESS [7.199s]
[INFO] Apache Sling Web Console Branding ................. SUCCESS [4.454s]
[INFO] Apache Sling Web Console Security Provider ........ SUCCESS [6.456s]
[INFO] Apache Sling Explorer ............................. SUCCESS [8.738s]
[INFO] Apache Sling Health Check Core .................... SUCCESS [10.341s]
[INFO] Apache Sling Health Check Annotations ............. SUCCESS [7.223s]
[INFO] Apache Sling Health Check Samples ................. SUCCESS [6.626s]
[INFO] Apache Sling Health Check Support Components ...... SUCCESS [7.206s]
[INFO] Apache Sling Health Check Webconsole Plugin ....... SUCCESS [4.110s]
[INFO] Apache Sling Health Check JUnit Bridge ............ SUCCESS [5.648s]
[INFO] Apache Sling Health Check Integration Tests ....... SUCCESS [34.399s]
[INFO] Apache Sling Health Check Reactor POM ............. SUCCESS [4.002s]
[INFO] Apache Sling Resource Access Security ............. SUCCESS [4.215s]
[INFO] Apache Sling Test Tools ........................... SUCCESS [5.693s]
[INFO] Apache Sling Resource Access Security Integration Tests  FAILURE [5:06.000s]
[INFO] Apache Sling Validation Framework API ............. SKIPPED
[INFO] Apache Sling Validation Framework Core Implementation  SKIPPED
[INFO] Apache Sling Validation Framework Testing Services  SKIPPED
[INFO] Apache Sling Validation Framework Integration Tests  SKIPPED
[INFO] Apache Sling Validation Framework Examples ........ SKIPPED
[INFO] Apache Sling Validation Framework Builder ......... SKIPPED
[INFO] Apache Sling Models API ........................... SKIPPED
[INFO] Apache Sling Models Implementation ................ SKIPPED
[INFO] Apache Sling Models Validation Implementation ..... SKIPPED
[INFO] Apache Sling Models Integration Tests ............. SKIPPED
[INFO] Apache Sling Internationalization Support ......... SKIPPED
[INFO] Apache Sling XSS Protection Bundle ................ SKIPPED
[INFO] Apache Sling Testing Hamcrest ..................... SKIPPED
[INFO] Apache Sling JUnit Core ........................... SKIPPED
[INFO] Apache Sling JUnit Scriptable Tests Provider ...... SKIPPED
[INFO] Apache Sling JUnit Health Checks .................. SKIPPED
[INFO] Apache Sling JUnit Remote Tests Runners ........... SKIPPED
[INFO] Apache Sling JUnit Performance .................... SKIPPED
[INFO] Apache Sling JUnit Tests Teleporter ............... SKIPPED
[INFO] Apache Sling Testing Mock Log Configuration ....... SKIPPED
[INFO] Apache Sling Testing Resource Resolver Mock ....... SKIPPED
[INFO] Apache Sling Testing JCR Mock ..................... SKIPPED
[INFO] Apache Sling Testing OSGi Mock .................... SKIPPED
[INFO] Apache Sling Testing Sling Mock ................... SKIPPED
[INFO] Apache Sling Testing Sling Mock Jackrabbit-based Resource Resolver  SKIPPED
[INFO] Apache Sling Testing Sling Mock Oak-based Resource Resolver  SKIPPED
[INFO] Apache Sling Sample Server-Side Tests ............. SKIPPED
[INFO] Apache Sling Failing Server-Side Tests ............ SKIPPED
[INFO] Apache Sling Sample Integration Tests ............. SKIPPED
[INFO] Apache Sling Testing Modules Reactor .............. SKIPPED
[INFO] Apache Sling Installer ............................ SKIPPED
[INFO] Apache Sling Installer WebConsole Plugin .......... SKIPPED
[INFO] Apache Sling File Installer ....................... SKIPPED
[INFO] Apache Sling JCR Installer ........................ SKIPPED
[INFO] Apache Sling Installer Configuration Admin Support  SKIPPED
[INFO] Apache Sling Deployment Package Installer ......... SKIPPED
[INFO] Apache Sling Subsystems Installer ................. SKIPPED
[INFO] Apache Sling Installer Integration Tests .......... SKIPPED
[INFO] Apache Sling Launchpad API ........................ SKIPPED
[INFO] Apache Sling Launchpad Base ....................... SKIPPED
[INFO] Apache Sling Launchpad Installer .................. SKIPPED
[INFO] Apache Sling Launchpad Content .................... SKIPPED
[INFO] Apache Sling Launchpad Application Builder ........ SKIPPED
[INFO] Apache Sling Launchpad Testing Services ........... SKIPPED
[INFO] Apache Sling Launchpad Testing Services WAR ....... SKIPPED
[INFO] Apache Sling Launchpad Testing Fragment Bundle .... SKIPPED
[INFO] Apache Sling Launchpad Test Bundles ............... SKIPPED
[INFO] Apache Sling Integration Tests .................... SKIPPED
[INFO] Apache Sling Launchpad Testing .................... SKIPPED
[INFO] Apache Sling (Builder) ............................ SKIPPED
[INFO] ------------------------------------------------------------------------
[INFO] BUILD FAILURE
[INFO] ------------------------------------------------------------------------
[INFO] Total time: 1:12:26.174s
[INFO] Finished at: Mon Oct 19 20:07:10 UTC 2015
[INFO] Final Memory: 142M/331M
[INFO] ------------------------------------------------------------------------
[JENKINS] Archiving disabled
[JENKINS] Archiving disabled
[JENKINS] Archiving disabled
[JENKINS] Archiving disabled
[JENKINS] Archiving disabled
[JENKINS] Archiving disabled
[JENKINS] Archiving disabled
[JENKINS] Archiving disabled
[JENKINS] Archiving disabled
[JENKINS] Archiving disabled
[JENKINS] Archiving disabled
[JENKINS] Archiving disabled
[JENKINS] Archiving disabled
[JENKINS] Archiving disabled
[JENKINS] Archiving disabled
[JENKINS] Archiving disabled
[JENKINS] Archiving disabled
[JENKINS] Archiving disabled
[JENKINS] Archiving disabled
[JENKINS] Archiving disabled
[JENKINS] Archiving disabled
[JENKINS] Archiving disabled
[JENKINS] Archiving disabled
[JENKINS] Archiving disabled
[JENKINS] Archiving disabled
[JENKINS] Archiving disabled
[JENKINS] Archiving disabled
[JENKINS] Archiving disabled
[JENKINS] Archiving disabled
[JENKINS] Archiving disabled
[JENKINS] Archiving disabled
[JENKINS] Archiving disabled
[JENKINS] Archiving disabled
[JENKINS] Archiving disabled
[JENKINS] Archiving disabled
[JENKINS] Archiving disabled
[JENKINS] Archiving disabled
[JENKINS] Archiving disabled
[JENKINS] Archiving disabled
[JENKINS] Archiving disabled
[JENKINS] Archiving disabled
[JENKINS] Archiving disabled
[JENKINS] Archiving disabled
[JENKINS] Archiving disabled
[JENKINS] Archiving disabled
[JENKINS] Archiving disabled
[JENKINS] Archiving disabled
[JENKINS] Archiving disabled
[JENKINS] Archiving disabled
[JENKINS] Archiving disabled
[JENKINS] Archiving disabled
[JENKINS] Archiving disabled
[JENKINS] Archiving disabled
[JENKINS] Archiving disabled
[JENKINS] Archiving disabled
[JENKINS] Archiving disabled
[JENKINS] Archiving disabled
[JENKINS] Archiving disabled
[JENKINS] Archiving disabled
[JENKINS] Archiving disabled
[JENKINS] Archiving disabled
[JENKINS] Archiving disabled
[JENKINS] Archiving disabled
[JENKINS] Archiving disabled
[JENKINS] Archiving disabled
[JENKINS] Archiving disabled
[JENKINS] Archiving disabled
[JENKINS] Archiving disabled
[JENKINS] Archiving disabled
[JENKINS] Archiving disabled
[JENKINS] Archiving disabled
[JENKINS] Archiving disabled
[JENKINS] Archiving disabled
[JENKINS] Archiving disabled
[JENKINS] Archiving disabled
[JENKINS] Archiving disabled
[JENKINS] Archiving disabled
[JENKINS] Archiving disabled
[JENKINS] Archiving disabled
[JENKINS] Archiving disabled
[JENKINS] Archiving disabled
[JENKINS] Archiving disabled
[JENKINS] Archiving disabled
[JENKINS] Archiving disabled
[JENKINS] Archiving disabled
[JENKINS] Archiving disabled
[JENKINS] Archiving disabled
[JENKINS] Archiving disabled
[JENKINS] Archiving disabled
[JENKINS] Archiving disabled
[JENKINS] Archiving disabled
[JENKINS] Archiving disabled
[JENKINS] Archiving disabled
[JENKINS] Archiving disabled
[JENKINS] Archiving disabled
[JENKINS] Archiving disabled
[JENKINS] Archiving disabled
[JENKINS] Archiving disabled
[JENKINS] Archiving disabled
[JENKINS] Archiving disabled
[JENKINS] Archiving disabled
[JENKINS] Archiving disabled
[JENKINS] Archiving disabled
[JENKINS] Archiving disabled
[JENKINS] Archiving disabled
[JENKINS] Archiving disabled
[JENKINS] Archiving disabled
[JENKINS] Archiving disabled
[JENKINS] Archiving disabled
[JENKINS] Archiving disabled
[JENKINS] Archiving disabled
[JENKINS] Archiving disabled
[JENKINS] Archiving disabled
[JENKINS] Archiving disabled
[JENKINS] Archiving disabled
[JENKINS] Archiving disabled
[JENKINS] Archiving disabled
[JENKINS] Archiving disabled
[JENKINS] Archiving disabled
[JENKINS] Archiving disabled
[JENKINS] Archiving disabled
[JENKINS] Archiving disabled
[JENKINS] Archiving disabled
[JENKINS] Archiving disabled
[JENKINS] Archiving disabled
[JENKINS] Archiving disabled
[JENKINS] Archiving disabled
[JENKINS] Archiving disabled
[JENKINS] Archiving disabled
[JENKINS] Archiving disabled
[JENKINS] Archiving disabled
[JENKINS] Archiving disabled
[JENKINS] Archiving disabled
[JENKINS] Archiving disabled
[JENKINS] Archiving disabled
[JENKINS] Archiving disabled
[JENKINS] Archiving disabled
Waiting for Jenkins to finish collecting data
[ERROR] Failed to execute goal org.apache.rat:apache-rat-plugin:0.11:check (default) on project
org.apache.sling.resourceaccesssecurity.it: Too many files with unapproved license: 1 See
RAT report in: <https://builds.apache.org/job/sling-trunk-1.7/ws/trunk/bundles/resourceaccesssecurity/it/target/rat.txt>
-> [Help 1]
[ERROR] 
[ERROR] To see the full stack trace of the errors, re-run Maven with the -e switch.
[ERROR] Re-run Maven using the -X switch to enable full debug logging.
[ERROR] 
[ERROR] For more information about the errors and possible solutions, please read the following
articles:
[ERROR] [Help 1] http://cwiki.apache.org/confluence/display/MAVEN/MojoFailureException
[ERROR] 
[ERROR] After correcting the problems, you can resume the build with the command
[ERROR]   mvn <goals> -rf :org.apache.sling.resourceaccesssecurity.it
channel stopped

Mime
View raw message