sling-commits mailing list archives

Site index · List index
Message view « Date » · « Thread »
Top « Date » · « Thread »
From Apache Jenkins Server <jenk...@builds.apache.org>
Subject Build failed in Jenkins: sling-trunk-1.8 #1716
Date Wed, 07 Oct 2015 14:49:21 GMT
See <https://builds.apache.org/job/sling-trunk-1.8/1716/changes>

Changes:

[olli] SLING-4871 use component configurations instead of framework properties

* remove repository.home from settings
* add repository.home for org.apache.jackrabbit.oak.plugins.segment.SegmentNodeStoreService
* add localIndexDir for org.apache.jackrabbit.oak.plugins.index.lucene.LuceneIndexProviderService

[rombert] SLING-5114 - Remove OakOnly and JackrabbitOnly annotations

Further cleanup of annotations

------------------------------------------
[...truncated 14582 lines...]
[INFO] Apache Sling Launchpad Application Builder ........ SKIPPED
[INFO] Apache Sling Scripting Sightly Integration Tests .. SKIPPED
[INFO] Apache Sling Scripting Sightly Reactor ............ SKIPPED
[INFO] Apache Sling Adapter Manager Implementation ....... SKIPPED
[INFO] Apache Sling Bundle Resource Provider ............. SKIPPED
[INFO] Apache Sling Distributed Event Admin .............. SKIPPED
[INFO] Apache Sling Discovery API ........................ SKIPPED
[INFO] Apache Sling Discovery Commons Bundle ............. SKIPPED
[INFO] Apache Sling Resource-Based Discovery Service ..... SKIPPED
[INFO] Apache Sling Discovery Support Bundle ............. SKIPPED
[INFO] Apache Sling Discovery Standalone Implementation .. SKIPPED
[INFO] Apache Sling Event Support ........................ SKIPPED
[INFO] Apache Sling Feature Flags ........................ SKIPPED
[INFO] Apache Sling Filesystem Resource Provider ......... SKIPPED
[INFO] Apache Sling javax.activation bundle .............. SKIPPED
[INFO] Apache Sling Service User Mapper .................. SKIPPED
[INFO] Apache Sling Settings ............................. SKIPPED
[INFO] Apache Sling Web Console Branding ................. SKIPPED
[INFO] Apache Sling Web Console Security Provider ........ SKIPPED
[INFO] Apache Sling Explorer ............................. SKIPPED
[INFO] Apache Sling Health Check Core .................... SKIPPED
[INFO] Apache Sling Health Check Annotations ............. SKIPPED
[INFO] Apache Sling Health Check Samples ................. SKIPPED
[INFO] Apache Sling Health Check Support Components ...... SKIPPED
[INFO] Apache Sling Health Check Webconsole Plugin ....... SKIPPED
[INFO] Apache Sling Health Check JUnit Bridge ............ SKIPPED
[INFO] Apache Sling Health Check Integration Tests ....... SKIPPED
[INFO] Apache Sling Health Check Reactor POM ............. SKIPPED
[INFO] Apache Sling Resource Access Security ............. SKIPPED
[INFO] Apache Sling Test Tools ........................... SKIPPED
[INFO] Apache Sling Resource Access Security Integration Tests  SKIPPED
[INFO] Apache Sling Validation Framework API ............. SKIPPED
[INFO] Apache Sling Validation Framework Core Implementation  SKIPPED
[INFO] Apache Sling Validation Framework Testing Services  SKIPPED
[INFO] Apache Sling Validation Framework Integration Tests  SKIPPED
[INFO] Apache Sling Validation Framework Examples ........ SKIPPED
[INFO] Apache Sling Validation Framework Builder ......... SKIPPED
[INFO] Apache Sling Models API ........................... SKIPPED
[INFO] Apache Sling Models Implementation ................ SKIPPED
[INFO] Apache Sling Models Validation Implementation ..... SKIPPED
[INFO] Apache Sling Models Integration Tests ............. SKIPPED
[INFO] Apache Sling Internationalization Support ......... SKIPPED
[INFO] Apache Sling XSS Protection Bundle ................ SKIPPED
[INFO] Apache Sling Testing Hamcrest ..................... SKIPPED
[INFO] Apache Sling JUnit Core ........................... SKIPPED
[INFO] Apache Sling JUnit Scriptable Tests Provider ...... SKIPPED
[INFO] Apache Sling JUnit Health Checks .................. SKIPPED
[INFO] Apache Sling JUnit Remote Tests Runners ........... SKIPPED
[INFO] Apache Sling JUnit Performance .................... SKIPPED
[INFO] Apache Sling JUnit Tests Teleporter ............... SKIPPED
[INFO] Apache Sling Testing Mock Log Configuration ....... SKIPPED
[INFO] Apache Sling Testing Resource Resolver Mock ....... SKIPPED
[INFO] Apache Sling Testing JCR Mock ..................... SKIPPED
[INFO] Apache Sling Testing OSGi Mock .................... SKIPPED
[INFO] Apache Sling Testing Sling Mock ................... SKIPPED
[INFO] Apache Sling Testing Sling Mock Jackrabbit-based Resource Resolver  SKIPPED
[INFO] Apache Sling Testing Sling Mock Oak-based Resource Resolver  SKIPPED
[INFO] Apache Sling Sample Server-Side Tests ............. SKIPPED
[INFO] Apache Sling Failing Server-Side Tests ............ SKIPPED
[INFO] Apache Sling Sample Integration Tests ............. SKIPPED
[INFO] Apache Sling Testing Modules Reactor .............. SKIPPED
[INFO] Apache Sling Installer ............................ SKIPPED
[INFO] Apache Sling Installer WebConsole Plugin .......... SKIPPED
[INFO] Apache Sling File Installer ....................... SKIPPED
[INFO] Apache Sling JCR Installer ........................ SKIPPED
[INFO] Apache Sling Installer Configuration Admin Support  SKIPPED
[INFO] Apache Sling Deployment Package Installer ......... SKIPPED
[INFO] Apache Sling Subsystems Installer ................. SKIPPED
[INFO] Apache Sling Installer Integration Tests .......... SKIPPED
[INFO] Apache Sling Launchpad API ........................ SKIPPED
[INFO] Apache Sling Launchpad Base ....................... SKIPPED
[INFO] Apache Sling Launchpad Installer .................. SKIPPED
[INFO] Apache Sling Launchpad Content .................... SKIPPED
[INFO] Apache Sling Launchpad Testing Services ........... SKIPPED
[INFO] Apache Sling Launchpad Testing Services WAR ....... SKIPPED
[INFO] Apache Sling Launchpad Testing Fragment Bundle .... SKIPPED
[INFO] Apache Sling Launchpad Test Bundles ............... SKIPPED
[INFO] Apache Sling Integration Tests .................... SKIPPED
[INFO] Apache Sling Launchpad Testing .................... SKIPPED
[INFO] Apache Sling (Builder) ............................ SKIPPED
[INFO] ------------------------------------------------------------------------
[INFO] BUILD FAILURE
[INFO] ------------------------------------------------------------------------
[INFO] Total time: 5:07.548s
[INFO] Finished at: Wed Oct 07 14:49:20 UTC 2015
[INFO] Final Memory: 130M/459M
[INFO] ------------------------------------------------------------------------
[JENKINS] Archiving disabled
[JENKINS] Archiving disabled
[JENKINS] Archiving disabled
[JENKINS] Archiving disabled
[JENKINS] Archiving disabled
[JENKINS] Archiving disabled
[JENKINS] Archiving disabled
[JENKINS] Archiving disabled
[JENKINS] Archiving disabled
[JENKINS] Archiving disabled
[JENKINS] Archiving disabled
[JENKINS] Archiving disabled
[JENKINS] Archiving disabled
[JENKINS] Archiving disabled
[JENKINS] Archiving disabled
[JENKINS] Archiving disabled
[JENKINS] Archiving disabled
[JENKINS] Archiving disabled
[JENKINS] Archiving disabled
[JENKINS] Archiving disabled
[JENKINS] Archiving disabled
[JENKINS] Archiving disabled
[JENKINS] Archiving disabled
[JENKINS] Archiving disabled
[JENKINS] Archiving disabled
[JENKINS] Archiving disabled
[JENKINS] Archiving disabled
[JENKINS] Archiving disabled
[JENKINS] Archiving disabled
[JENKINS] Archiving disabled
[JENKINS] Archiving disabled
[JENKINS] Archiving disabled
[JENKINS] Archiving disabled
[JENKINS] Archiving disabled
[JENKINS] Archiving disabled
[JENKINS] Archiving disabled
[JENKINS] Archiving disabled
[JENKINS] Archiving disabled
[JENKINS] Archiving disabled
[JENKINS] Archiving disabled
[JENKINS] Archiving disabled
[JENKINS] Archiving disabled
[JENKINS] Archiving disabled
[JENKINS] Archiving disabled
[JENKINS] Archiving disabled
[JENKINS] Archiving disabled
[JENKINS] Archiving disabled
[JENKINS] Archiving disabled
[JENKINS] Archiving disabled
[JENKINS] Archiving disabled
[JENKINS] Archiving disabled
[JENKINS] Archiving disabled
[JENKINS] Archiving disabled
[JENKINS] Archiving disabled
[JENKINS] Archiving disabled
[JENKINS] Archiving disabled
[JENKINS] Archiving disabled
[JENKINS] Archiving disabled
[JENKINS] Archiving disabled
[JENKINS] Archiving disabled
[JENKINS] Archiving disabled
[JENKINS] Archiving disabled
[JENKINS] Archiving disabled
[JENKINS] Archiving disabled
[JENKINS] Archiving disabled
[JENKINS] Archiving disabled
[JENKINS] Archiving disabled
[JENKINS] Archiving disabled
[JENKINS] Archiving disabled
[JENKINS] Archiving disabled
[JENKINS] Archiving disabled
[JENKINS] Archiving disabled
[JENKINS] Archiving disabled
[JENKINS] Archiving disabled
[JENKINS] Archiving disabled
[JENKINS] Archiving disabled
[JENKINS] Archiving disabled
[JENKINS] Archiving disabled
[JENKINS] Archiving disabled
[JENKINS] Archiving disabled
[JENKINS] Archiving disabled
[JENKINS] Archiving disabled
[JENKINS] Archiving disabled
[JENKINS] Archiving disabled
[JENKINS] Archiving disabled
[JENKINS] Archiving disabled
[JENKINS] Archiving disabled
[JENKINS] Archiving disabled
[JENKINS] Archiving disabled
[JENKINS] Archiving disabled
[JENKINS] Archiving disabled
[JENKINS] Archiving disabled
[JENKINS] Archiving disabled
[JENKINS] Archiving disabled
[JENKINS] Archiving disabled
[JENKINS] Archiving disabled
[JENKINS] Archiving disabled
[JENKINS] Archiving disabled
[JENKINS] Archiving disabled
[JENKINS] Archiving disabled
[JENKINS] Archiving disabled
[JENKINS] Archiving disabled
[JENKINS] Archiving disabled
[JENKINS] Archiving disabled
[JENKINS] Archiving disabled
[JENKINS] Archiving disabled
[JENKINS] Archiving disabled
[JENKINS] Archiving disabled
[JENKINS] Archiving disabled
[JENKINS] Archiving disabled
[JENKINS] Archiving disabled
[JENKINS] Archiving disabled
[JENKINS] Archiving disabled
[JENKINS] Archiving disabled
[JENKINS] Archiving disabled
[JENKINS] Archiving disabled
[JENKINS] Archiving disabled
[JENKINS] Archiving disabled
[JENKINS] Archiving disabled
[JENKINS] Archiving disabled
[JENKINS] Archiving disabled
[JENKINS] Archiving disabled
[JENKINS] Archiving disabled
[JENKINS] Archiving disabled
[JENKINS] Archiving disabled
[JENKINS] Archiving disabled
[JENKINS] Archiving disabled
[JENKINS] Archiving disabled
[JENKINS] Archiving disabled
[JENKINS] Archiving disabled
[JENKINS] Archiving disabled
[JENKINS] Archiving disabled
[JENKINS] Archiving disabled
[JENKINS] Archiving disabled
[JENKINS] Archiving disabled
[JENKINS] Archiving disabled
[JENKINS] Archiving disabled
[JENKINS] Archiving disabled
[JENKINS] Archiving disabled
[JENKINS] Archiving disabled
[JENKINS] Archiving disabled
[JENKINS] Archiving disabled
[JENKINS] Archiving disabled
[JENKINS] Archiving disabled
[JENKINS] Archiving disabled
[JENKINS] Archiving disabled
[JENKINS] Archiving disabled
[JENKINS] Archiving disabled
[JENKINS] Archiving disabled
[JENKINS] Archiving disabled
Waiting for Jenkins to finish collecting data[ERROR] Failed to execute goal org.apache.felix:maven-bundle-plugin:3.0.0:baseline
(baseline) on project org.apache.sling.auth.core: Baseline failed, see generated report ->
[Help 1]
[ERROR] 
[ERROR] To see the full stack trace of the errors, re-run Maven with the -e switch.
[ERROR] Re-run Maven using the -X switch to enable full debug logging.
[ERROR] 
[ERROR] For more information about the errors and possible solutions, please read the following
articles:
[ERROR] [Help 1] http://cwiki.apache.org/confluence/display/MAVEN/MojoFailureException
[ERROR] 
[ERROR] After correcting the problems, you can resume the build with the command
[ERROR]   mvn <goals> -rf :org.apache.sling.auth.core

channel stopped

Mime
View raw message