sling-commits mailing list archives

Site index · List index
Message view « Date » · « Thread »
Top « Date » · « Thread »
From Apache Jenkins Server <jenk...@builds.apache.org>
Subject Build failed in Jenkins: sling-contrib-1.7 #444
Date Wed, 07 Oct 2015 20:54:44 GMT
See <https://builds.apache.org/job/sling-contrib-1.7/444/changes>

Changes:

[olli] SLING-3027 use latest releases (Sling Discovery Impl, Sling Event DEA, Sling Servlets
Resolver, Jackrabbit, Oak)

------------------------------------------
[...truncated 3141 lines...]
[JENKINS] Recording test results[INFO] 
[INFO] --- animal-sniffer-maven-plugin:1.14:check (default) @ org.apache.sling.distribution.api
---
[INFO] Checking unresolved references to org.codehaus.mojo.signature:java16:1.0

[INFO] 
[INFO] --- maven-bundle-plugin:3.0.0:bundle (default-bundle) @ org.apache.sling.distribution.api
---
[INFO] 
[INFO] --- maven-enforcer-plugin:1.3.1:enforce (enforce-java) @ org.apache.sling.distribution.api
---
[INFO] 
[INFO] --- maven-antrun-plugin:1.8:run (set-bundle-required-execution-environment) @ org.apache.sling.distribution.api
---
[INFO] Executing tasks

main:
[INFO] Executed tasks
[WARNING] Failed to getClass for org.apache.maven.plugin.source.SourceJarMojo
[INFO] 
[INFO] --- maven-source-plugin:2.4:jar (attach-sources) @ org.apache.sling.distribution.api
---
[INFO] Building jar: <https://builds.apache.org/job/sling-contrib-1.7/ws/trunk/extensions/distribution/api/target/org.apache.sling.distribution.api-0.2.1-SNAPSHOT-sources.jar>
[INFO] 
[INFO] --- maven-site-plugin:3.4:attach-descriptor (attach-descriptor) @ org.apache.sling.distribution.api
---
[INFO] 
[INFO] --- ianal-maven-plugin:1.0-alpha-1:verify-legal-files (default) @ org.apache.sling.distribution.api
---
[INFO] Checking legal files in: org.apache.sling.distribution.api-0.2.1-SNAPSHOT.jar
[INFO] Checking legal files in: org.apache.sling.distribution.api-0.2.1-SNAPSHOT-sources.jar
[INFO] 
[INFO] --- apache-rat-plugin:0.11:check (default) @ org.apache.sling.distribution.api ---
[INFO] 51 implicit excludes (use -debug for more details).
[INFO] Exclude: src/main/appended-resources/META-INF/*
[INFO] Exclude: velocity.log
[INFO] Exclude: target/*
[INFO] Exclude: README.md
[INFO] Exclude: maven-eclipse.xml
[INFO] Exclude: .*
[INFO] Exclude: .*/**
[INFO] Exclude: **/*.json
[INFO] Exclude: DEPENDENCIES
[INFO] Exclude: **/*.rej
[INFO] 14 resources included (use -debug for more details)
[INFO] Rat check: Summary of files. Unapproved: 0 unknown: 0 generated: 0 approved: 14 licence.
[INFO] 
[INFO] --- maven-bundle-plugin:3.0.0:baseline (baseline) @ org.apache.sling.distribution.api
---
[INFO] artifact org.apache.sling:org.apache.sling.distribution.api: checking for updates from
Nexus
[INFO] artifact org.apache.sling:org.apache.sling.distribution.api: checking for updates from
central
[INFO] Baseline Report - Generated by Apache Felix Maven Bundle Plugin on 2015-10-07T20:53Z
based on Bnd - see http://www.aqute.biz/Bnd/Bnd
[INFO] Comparing bundle org.apache.sling.distribution.api version 0.2.1-SNAPSHOT to version
0.1.0
[INFO] 
[INFO]   PACKAGE_NAME                                       DELTA      CUR_VER    BASE_VER
  REC_VER    WARNINGS  
[INFO] = ================================================== ========== ========== ==========
========== ==========
[INFO] < org.apache.sling.distribution                      minor      0.2.0      0.1.0
     0.2.0      -         
[INFO]      < class org.apache.sling.distribution.SimpleDistributionRequest
[INFO]          + method <init>(Lorg/apache/sling/distribution/DistributionRequestType;[Ljava/lang/String;Ljava/util/Set<Ljava/lang/String;>;)
[INFO]              + annotated javax.annotation.Nonnull
[INFO]              + annotated javax.annotation.Nonnull
[INFO]              + annotated javax.annotation.Nonnull
[INFO]          + annotated aQute.bnd.annotation.ProviderType
[INFO]      < enum org.apache.sling.distribution.DistributionRequestState
[INFO]          + field org.apache.sling.distribution.DistributionRequestState NOT_EXECUTED
[INFO]              + access final
[INFO]              + access static
[INFO]          + annotated aQute.bnd.annotation.ProviderType
[INFO]      ~ enum org.apache.sling.distribution.DistributionRequestType
[INFO]          + annotated aQute.bnd.annotation.ProviderType
[INFO]      - version 0.1.0
[INFO]      + version 0.2.0
[INFO] -----------------------------------------------------------------------------------------------------------
[INFO] ~ org.apache.sling.distribution.event                changed    0.1.1      0.1.0  
   0.1.1      -         
[INFO]      ~ interface org.apache.sling.distribution.event.DistributionEventProperties
[INFO]          + annotated aQute.bnd.annotation.ProviderType
[INFO]      ~ interface org.apache.sling.distribution.event.DistributionEventTopics
[INFO]          + annotated aQute.bnd.annotation.ProviderType
[INFO]      - version 0.1.0
[INFO]      + version 0.1.1
[INFO] -----------------------------------------------------------------------------------------------------------
[INFO]   org.apache.sling.distribution.transport            unchanged  0.1.0      0.1.0  
   0.1.0      -         
[INFO] -----------------------------------------------------------------------------------------------------------
[INFO] Baseline analysis complete, 0 error(s), 0 warning(s)
[INFO] 
[INFO] --- maven-install-plugin:2.5.2:install (default-install) @ org.apache.sling.distribution.api
---
[INFO] Installing <https://builds.apache.org/job/sling-contrib-1.7/ws/trunk/extensions/distribution/api/target/org.apache.sling.distribution.api-0.2.1-SNAPSHOT.jar>
to /home/jenkins/jenkins-slave/maven-repositories/1/org/apache/sling/org.apache.sling.distribution.api/0.2.1-SNAPSHOT/org.apache.sling.distribution.api-0.2.1-SNAPSHOT.jar
[INFO] Installing <https://builds.apache.org/job/sling-contrib-1.7/ws/trunk/extensions/distribution/api/pom.xml>
to /home/jenkins/jenkins-slave/maven-repositories/1/org/apache/sling/org.apache.sling.distribution.api/0.2.1-SNAPSHOT/org.apache.sling.distribution.api-0.2.1-SNAPSHOT.pom
[INFO] Installing <https://builds.apache.org/job/sling-contrib-1.7/ws/trunk/extensions/distribution/api/target/org.apache.sling.distribution.api-0.2.1-SNAPSHOT-sources.jar>
to /home/jenkins/jenkins-slave/maven-repositories/1/org/apache/sling/org.apache.sling.distribution.api/0.2.1-SNAPSHOT/org.apache.sling.distribution.api-0.2.1-SNAPSHOT-sources.jar
[INFO] 
[INFO] --- maven-bundle-plugin:3.0.0:install (default-install) @ org.apache.sling.distribution.api
---
[INFO] Local OBR update disabled (enable with -DobrRepository)
[JENKINS] Archiving disabled
[INFO]                                                                         
[INFO] ------------------------------------------------------------------------
[INFO] Building Apache Sling Distribution Core 0.1.9-SNAPSHOT
[INFO] ------------------------------------------------------------------------
Downloading: http://repo.maven.apache.org/maven2/org/apache/sling/org.apache.sling.distribution.api/0.2.0/org.apache.sling.distribution.api-0.2.0.pom
[WARNING] The POM for org.apache.sling:org.apache.sling.distribution.api:jar:0.2.0 is missing,
no dependency information available
Downloading: http://repo.maven.apache.org/maven2/org/apache/sling/org.apache.sling.distribution.api/0.2.0/org.apache.sling.distribution.api-0.2.0.jar
[JENKINS] Archiving disabled
[INFO] ------------------------------------------------------------------------
[INFO] Reactor Summary:
[INFO] 
[INFO] Apache Sling OpenID Authentication ................ SUCCESS [24.061s]
[INFO] Apache Sling Authentication XING API .............. SUCCESS [5.195s]
[INFO] Apache Sling Authentication XING Login ............ SUCCESS [7.644s]
[INFO] Apache Sling Authentication XING OAuth ............ SUCCESS [6.767s]
[INFO] Apache Sling Authentication Selector .............. SUCCESS [8.395s]
[INFO] Apache Sling Commons HTML Utilities ............... SUCCESS [7.213s]
[INFO] Apache Sling APT parser ........................... SUCCESS [10.346s]
[INFO] Apache Sling APT servlet .......................... SUCCESS [8.209s]
[INFO] Apache Sling Resource Collection API .............. SUCCESS [13.126s]
[INFO] Apache Sling DataSource Provider .................. SUCCESS [9.970s]
[INFO] Apache Sling Dojo JavaScript Library .............. SUCCESS [33.596s]
[INFO] Apache Sling Dojo Data Extension .................. SUCCESS [7.507s]
[INFO] Apache Sling FTP Server ........................... SUCCESS [8.299s]
[INFO] Apache Sling Google Web Toolkit Servlet Library ... SUCCESS [7.298s]
[INFO] Apache Sling Google Web Toolkit Sample ............ SUCCESS [36.132s]
[INFO] Apache Sling JMX Resource Provider ................ SUCCESS [3.914s]
[INFO] Apache Sling ClassLoader Leak Detector ............ SUCCESS [6.100s]
[INFO] Apache Sling MongoDB Resource Provider ............ SUCCESS [6.467s]
[INFO] Apache Sling OSGi Bundle Repository ............... SUCCESS [7.809s]
[INFO] Apache Sling Distribution API ..................... SUCCESS [4.725s]
[INFO] Apache Sling Distribution Core .................... FAILURE [0.524s]
[INFO] Apache Sling Distribution Sample .................. SKIPPED
[INFO] Apache Sling Distribution Integration Tests ....... SKIPPED
[INFO] Apache Sling Log Tail Implementation .............. SKIPPED
[INFO] S3 dependencies for Oak ........................... SKIPPED
[INFO] Apache Sling Request Processing Analyzer .......... SKIPPED
[INFO] Apache Sling Resource Merger ...................... SKIPPED
[INFO] Apache Sling Inventory Printer Based on Resources . SKIPPED
[INFO] Apache Sling Rewriter ............................. SKIPPED
[INFO] Apache Sling Security ............................. SKIPPED
[INFO] Apache Sling SLF4J MDC Filter ..................... SKIPPED
[INFO] Apache Sling Query ................................ SKIPPED
[INFO] Apache Sling Superimposing Resource Provider ...... SKIPPED
[INFO] Apache Sling Tenant ............................... SKIPPED
[INFO] Apache Sling URL Rewriter ......................... SKIPPED
[INFO] Apache Sling JCR Java Compiler .................... SKIPPED
[INFO] Apache Sling Repository Accessor .................. SKIPPED
[INFO] Apache Sling Object Content Mapping ............... SKIPPED
[INFO] Apache Sling JCR Prefs ............................ SKIPPED
[INFO] Apache Sling JCR Resource Security ................ SKIPPED
[INFO] Apache Sling Script Console ....................... SKIPPED
[INFO] Apache Sling Atom Tag Library ..................... SKIPPED
[INFO] Apache Sling Scripting Freemarker Support ......... SKIPPED
[INFO] Apache Sling Scripting Groovy Support ............. SKIPPED
[INFO] Apache Sling Scripting Java Support ............... SKIPPED
[INFO] Apache Sling Scripting JST Support ................ SKIPPED
[INFO] Apache Sling Scripting Python Support ............. SKIPPED
[INFO] Apache Sling Scripting Ruby Support ............... SKIPPED
[INFO] Scala Script Engine ............................... SKIPPED
[INFO] Apache Sling Scala Scripting Configuration ........ SKIPPED
[INFO] Scala for Sling Demo Application - Hello World .... SKIPPED
[INFO] Scala for Sling Demo Application - Forum .......... SKIPPED
[INFO] Apache Sling Scripting Thymeleaf .................. SKIPPED
[INFO] Apache Sling Scripting Velocity Support ........... SKIPPED
[INFO] Apache Sling Scripting W3C XML Processing Support . SKIPPED
[INFO] Apache Sling NoSQL Generic Resource Provider ...... SKIPPED
[INFO] Apache Sling NoSQL Couchbase Client ............... SKIPPED
[INFO] Apache Sling NoSQL Couchbase Resource Provider .... SKIPPED
[INFO] Apache Sling NoSQL MongoDB Resource Provider ...... SKIPPED
[INFO] Apache Sling Launchpad Contrib Testing ............ SKIPPED
[INFO] Apache Sling Launchpad Karaf ...................... SKIPPED
[INFO] Apache Sling Launchpad Karaf - Features ........... SKIPPED
[INFO] Apache Sling Launchpad Karaf - Integration Tests .. SKIPPED
[INFO] Apache Sling Launchpad Karaf - Launchpad Jackrabbit Derby Integration Tests  SKIPPED
[INFO] Apache Sling Launchpad Karaf - Launchpad Oak Tar Integration Tests  SKIPPED
[INFO] Apache Sling Launchpad Karaf Builder .............. SKIPPED
[INFO] Apache Sling Contrib (Builder) .................... SKIPPED
[INFO] ------------------------------------------------------------------------
[INFO] BUILD FAILURE
[INFO] ------------------------------------------------------------------------
[INFO] Total time: 4:21.729s
[INFO] Finished at: Wed Oct 07 20:53:40 UTC 2015
[INFO] Final Memory: 69M/263M
[INFO] ------------------------------------------------------------------------
[JENKINS] Archiving disabled
[JENKINS] Archiving disabled
[JENKINS] Archiving disabled
[JENKINS] Archiving disabled
[JENKINS] Archiving disabled
[JENKINS] Archiving disabled
[JENKINS] Archiving disabled
[JENKINS] Archiving disabled
[JENKINS] Archiving disabled
[JENKINS] Archiving disabled
[JENKINS] Archiving disabled
[JENKINS] Archiving disabled
[JENKINS] Archiving disabled
[JENKINS] Archiving disabled
[JENKINS] Archiving disabled
[JENKINS] Archiving disabled
[JENKINS] Archiving disabled
[JENKINS] Archiving disabled
[JENKINS] Archiving disabled
[JENKINS] Archiving disabled
[JENKINS] Archiving disabled
[JENKINS] Archiving disabled
[JENKINS] Archiving disabled
[JENKINS] Archiving disabled
[JENKINS] Archiving disabled
[JENKINS] Archiving disabled
[JENKINS] Archiving disabled
[JENKINS] Archiving disabled
[JENKINS] Archiving disabled
[JENKINS] Archiving disabled
[JENKINS] Archiving disabled
[JENKINS] Archiving disabled
[JENKINS] Archiving disabled
[JENKINS] Archiving disabled
[JENKINS] Archiving disabled
[JENKINS] Archiving disabled
[JENKINS] Archiving disabled
[JENKINS] Archiving disabled
[JENKINS] Archiving disabled
[JENKINS] Archiving disabled
[JENKINS] Archiving disabled
[JENKINS] Archiving disabled
[JENKINS] Archiving disabled
[JENKINS] Archiving disabled
[JENKINS] Archiving disabled
[JENKINS] Archiving disabled
[JENKINS] Archiving disabled
[JENKINS] Archiving disabled
[JENKINS] Archiving disabled
[JENKINS] Archiving disabled
[JENKINS] Archiving disabled
[JENKINS] Archiving disabled
[JENKINS] Archiving disabled
[JENKINS] Archiving disabled
[JENKINS] Archiving disabled
[JENKINS] Archiving disabled
[JENKINS] Archiving disabled
[JENKINS] Archiving disabled
[JENKINS] Archiving disabled
[JENKINS] Archiving disabled
[JENKINS] Archiving disabled
[JENKINS] Archiving disabled
[JENKINS] Archiving disabled
[JENKINS] Archiving disabled
[JENKINS] Archiving disabled
[JENKINS] Archiving disabled
[JENKINS] Archiving disabled
Waiting for Jenkins to finish collecting data
[ERROR] Failed to execute goal on project org.apache.sling.distribution.core: Could not resolve
dependencies for project org.apache.sling:org.apache.sling.distribution.core:bundle:0.1.9-SNAPSHOT:
Could not find artifact org.apache.sling:org.apache.sling.distribution.api:jar:0.2.0 in central
(http://repo.maven.apache.org/maven2) -> [Help 1]
[ERROR] 
[ERROR] To see the full stack trace of the errors, re-run Maven with the -e switch.
[ERROR] Re-run Maven using the -X switch to enable full debug logging.
[ERROR] 
[ERROR] For more information about the errors and possible solutions, please read the following
articles:
[ERROR] [Help 1] http://cwiki.apache.org/confluence/display/MAVEN/DependencyResolutionException
[ERROR] 
[ERROR] After correcting the problems, you can resume the build with the command
[ERROR]   mvn <goals> -rf :org.apache.sling.distribution.core
channel stopped

Mime
View raw message