sling-commits mailing list archives

Site index · List index
Message view « Date » · « Thread »
Top « Date » · « Thread »
From Apache Jenkins Server <jenk...@builds.apache.org>
Subject Build failed in Jenkins: sling-contrib-1.7 #497
Date Sun, 25 Oct 2015 01:57:41 GMT
See <https://builds.apache.org/job/sling-contrib-1.7/497/>

------------------------------------------
[...truncated 5196 lines...]
	at org.junit.internal.runners.statements.RunAfters.evaluate(RunAfters.java:33)
	at org.junit.runners.ParentRunner.run(ParentRunner.java:309)
	at org.apache.maven.surefire.junit4.JUnit4Provider.execute(JUnit4Provider.java:283)
	at org.apache.maven.surefire.junit4.JUnit4Provider.executeWithRerun(JUnit4Provider.java:173)
	at org.apache.maven.surefire.junit4.JUnit4Provider.executeTestSet(JUnit4Provider.java:153)
	at org.apache.maven.surefire.junit4.JUnit4Provider.invoke(JUnit4Provider.java:128)
	at org.apache.maven.surefire.booter.ForkedBooter.invokeProviderInSameClassLoader(ForkedBooter.java:203)
	at org.apache.maven.surefire.booter.ForkedBooter.runSuitesInProcess(ForkedBooter.java:155)
	at org.apache.maven.surefire.booter.ForkedBooter.main(ForkedBooter.java:103)


Results :

Failed tests: 
  DistributionPackageImporterResourcesIntegrationTest>DistributionIntegrationTestBase.<clinit>:59
Server not ready after 60 seconds, giving up
Tests in error: 
  DistributionAgentResourcesIntegrationTest.org.apache.sling.distribution.it.DistributionAgentResourcesIntegrationTest
» NoClassDefFound
  DistributionAgentResourcesIntegrationTest.testDefaultAgentConfigurationResourcesOnAuthor
» NoClassDefFound
  DistributionAgentResourcesIntegrationTest.testDefaultAgentConfigurationResourcesOnPublish
» NoClassDefFound
  DistributionAgentResourcesIntegrationTest.testDefaultAgentsRootResource » NoClassDefFound
  DistributionAgentResourcesIntegrationTest.testDefaultAuthorAgentLogResources » NoClassDefFound
  DistributionAgentResourcesIntegrationTest.testDefaultAuthorAgentQueueResources » NoClassDefFound
  DistributionAgentResourcesIntegrationTest.testDefaultAuthorAgentResources » NoClassDefFound
  DistributionAgentResourcesIntegrationTest.testDefaultPublishAgentLogResources » NoClassDefFound
  DistributionAgentResourcesIntegrationTest.testDefaultPublishAgentQueueResources » NoClassDefFound
  DistributionAgentResourcesIntegrationTest.testDefaultPublishAgentResources » NoClassDefFound
  DistributionPackageExporterImporterTemporaryFoldersTest.org.apache.sling.distribution.it.DistributionPackageExporterImporterTemporaryFoldersTest
» NoClassDefFound
  DistributionPackageExporterImporterTemporaryFoldersTest.testAddExportImportTemp » NoClassDefFound
  DistributionPackageExporterImporterTest.org.apache.sling.distribution.it.DistributionPackageExporterImporterTest
» NoClassDefFound
  DistributionPackageExporterImporterTest.testAddExportImport » NoClassDefFound ...
  DistributionPackageExporterImporterTest.testDeleteExportImport » NoClassDefFound
  DistributionPackageImporterResourcesIntegrationTest.org.apache.sling.distribution.it.DistributionPackageImporterResourcesIntegrationTest
» NoClassDefFound
  DistributionPackageImporterResourcesIntegrationTest.testLocalImporterResource » NoClassDefFound
  DistributorTest.org.apache.sling.distribution.it.DistributorTest » NoClassDefFound
  DistributorTest.testAddContent » NoClassDefFound Could not initialize class or...
  ForwardDistributionTest.org.apache.sling.distribution.it.ForwardDistributionTest » NoClassDefFound
  ForwardDistributionTest.testAddContent » NoClassDefFound Could not initialize ...
  ForwardDistributionTest.testDeepAddTreeContent » NoClassDefFound Could not ini...
  ForwardDistributionTest.testDeepAddTreeExcludedContent » NoClassDefFound Could...
  ForwardDistributionTest.testDeepUpdateTreeContent » NoClassDefFound Could not ...
  ForwardDistributionTest.testDeleteContent » NoClassDefFound Could not initiali...
  ForwardDistributionTest.testShallowAddTreeContent » NoClassDefFound Could not ...
  ForwardDistributionTest.testShallowUpdateTreeContent » NoClassDefFound Could n...
  ForwardDistributionTest.testTestContent » NoClassDefFound Could not initialize...
  MultipleForwardDistributionTest.org.apache.sling.distribution.it.MultipleForwardDistributionTest
» NoClassDefFound
  MultipleForwardDistributionTest.testAddContent » NoClassDefFound Could not ini...
  MultipleForwardDistributionTest.testAddContentCheckPassiveQueue » NoClassDefFound
  MultipleForwardDistributionTest.testDeleteContent » NoClassDefFound Could not ...
  MultipleQueueDistributionTest.org.apache.sling.distribution.it.MultipleQueueDistributionTest
» NoClassDefFound
  MultipleQueueDistributionTest.testDistributeQueues » NoClassDefFound Could not...
  MultipleQueueDistributionTest.testQueues » NoClassDefFound Could not initializ...
  ReverseDistributionTest.org.apache.sling.distribution.it.ReverseDistributionTest » NoClassDefFound
  ReverseDistributionTest.testAddContent » NoClassDefFound Could not initialize ...
  ReverseDistributionTest.testDeleteContent » NoClassDefFound Could not initiali...
  SelectiveForwardDistributionTest.org.apache.sling.distribution.it.SelectiveForwardDistributionTest
» NoClassDefFound
  SelectiveForwardDistributionTest.testAddContent » NoClassDefFound Could not in...
  SelectiveForwardDistributionTest.testDeleteContent » NoClassDefFound Could not...
  SelectiveForwardDistributionTest.testQueues » NoClassDefFound Could not initia...

Tests run: 48, Failures: 1, Errors: 42, Skipped: 5

[JENKINS] Recording test results
[INFO] 
[INFO] --- ianal-maven-plugin:1.0-alpha-1:verify-legal-files (default) @ org.apache.sling.distribution.it
---
[INFO] Checking legal files in: org.apache.sling.distribution.it-0.1.1-SNAPSHOT.jar
[INFO] Checking legal files in: org.apache.sling.distribution.it-0.1.1-SNAPSHOT-sources.jar
[INFO] 
[INFO] --- maven-bundle-plugin:3.0.0:baseline (baseline) @ org.apache.sling.distribution.it
---
[INFO] artifact org.apache.sling:org.apache.sling.distribution.it: checking for updates from
Nexus
[INFO] artifact org.apache.sling:org.apache.sling.distribution.it: checking for updates from
central
[INFO] Baseline Report - Generated by Apache Felix Maven Bundle Plugin on 2015-10-25T01:58Z
based on Bnd - see http://www.aqute.biz/Bnd/Bnd
[INFO] Comparing bundle org.apache.sling.distribution.it version 0.1.1-SNAPSHOT to version
0.1.0
[INFO] 
[INFO]   PACKAGE_NAME                                       DELTA      CUR_VER    BASE_VER
  REC_VER    WARNINGS  
[INFO] = ================================================== ========== ========== ==========
========== ==========
[INFO] Baseline analysis complete, 0 error(s), 0 warning(s)
[INFO] 
[INFO] --- apache-rat-plugin:0.11:check (default) @ org.apache.sling.distribution.it ---
[INFO] 51 implicit excludes (use -debug for more details).
[INFO] Exclude: src/main/appended-resources/META-INF/*
[INFO] Exclude: velocity.log
[INFO] Exclude: target/*
[INFO] Exclude: README.md
[INFO] Exclude: maven-eclipse.xml
[INFO] Exclude: .*
[INFO] Exclude: .*/**
[INFO] Exclude: **/*.json
[INFO] Exclude: DEPENDENCIES
[INFO] Exclude: **/*.rej
[INFO] Exclude: derby.log
[INFO] Exclude: sling/**
[INFO] Exclude: src/main/resources/SLING-CONTENT/libs/test/install.author/*.json
[INFO] 17 resources included (use -debug for more details)
[INFO] Rat check: Summary of files. Unapproved: 1 unknown: 1 generated: 0 approved: 16 licence.
[JENKINS] Archiving disabled
[INFO] ------------------------------------------------------------------------
[INFO] Reactor Summary:
[INFO] 
[INFO] Apache Sling OpenID Authentication ................ SUCCESS [23.540s]
[INFO] Apache Sling Authentication XING API .............. SUCCESS [9.396s]
[INFO] Apache Sling Authentication XING Login ............ SUCCESS [6.153s]
[INFO] Apache Sling Authentication XING OAuth ............ SUCCESS [15.668s]
[INFO] Apache Sling Authentication Selector .............. SUCCESS [4.112s]
[INFO] Apache Sling Commons HTML Utilities ............... SUCCESS [11.295s]
[INFO] Apache Sling APT parser ........................... SUCCESS [11.720s]
[INFO] Apache Sling APT servlet .......................... SUCCESS [4.313s]
[INFO] Apache Sling Resource Collection API .............. SUCCESS [6.583s]
[INFO] Apache Sling DataSource Provider .................. SUCCESS [9.969s]
[INFO] Apache Sling Dojo JavaScript Library .............. SUCCESS [15.218s]
[INFO] Apache Sling Dojo Data Extension .................. SUCCESS [3.119s]
[INFO] Apache Sling FTP Server ........................... SUCCESS [4.887s]
[INFO] Apache Sling Google Web Toolkit Servlet Library ... SUCCESS [5.906s]
[INFO] Apache Sling Google Web Toolkit Sample ............ SUCCESS [33.166s]
[INFO] Apache Sling JMX Resource Provider ................ SUCCESS [2.476s]
[INFO] Apache Sling ClassLoader Leak Detector ............ SUCCESS [9.226s]
[INFO] Apache Sling MongoDB Resource Provider ............ SUCCESS [3.516s]
[INFO] Apache Sling OSGi Bundle Repository ............... SUCCESS [5.273s]
[INFO] Apache Sling Distribution API ..................... SUCCESS [4.830s]
[INFO] Apache Sling Distribution Core .................... SUCCESS [10.684s]
[INFO] Apache Sling Distribution Extensions .............. SUCCESS [8.608s]
[INFO] Apache Sling Distribution Sample .................. SUCCESS [4.034s]
[INFO] Apache Sling Distribution Integration Tests ....... FAILURE [1:10.118s]
[INFO] Apache Sling Log Tail Implementation .............. SKIPPED
[INFO] S3 dependencies for Oak ........................... SKIPPED
[INFO] Apache Sling Request Processing Analyzer .......... SKIPPED
[INFO] Apache Sling Resource Merger ...................... SKIPPED
[INFO] Apache Sling Inventory Printer Based on Resources . SKIPPED
[INFO] Apache Sling Rewriter ............................. SKIPPED
[INFO] Apache Sling Security ............................. SKIPPED
[INFO] Apache Sling SLF4J MDC Filter ..................... SKIPPED
[INFO] Apache Sling Query ................................ SKIPPED
[INFO] Apache Sling Superimposing Resource Provider ...... SKIPPED
[INFO] Apache Sling Tenant ............................... SKIPPED
[INFO] Apache Sling URL Rewriter ......................... SKIPPED
[INFO] Apache Sling JCR Java Compiler .................... SKIPPED
[INFO] Apache Sling Repository Accessor .................. SKIPPED
[INFO] Apache Sling Object Content Mapping ............... SKIPPED
[INFO] Apache Sling JCR Prefs ............................ SKIPPED
[INFO] Apache Sling JCR Resource Security ................ SKIPPED
[INFO] Apache Sling Script Console ....................... SKIPPED
[INFO] Apache Sling Atom Tag Library ..................... SKIPPED
[INFO] Apache Sling Scripting Freemarker Support ......... SKIPPED
[INFO] Apache Sling Scripting Groovy Support ............. SKIPPED
[INFO] Apache Sling Scripting Java Support ............... SKIPPED
[INFO] Apache Sling Scripting JST Support ................ SKIPPED
[INFO] Apache Sling Scripting Python Support ............. SKIPPED
[INFO] Apache Sling Scripting Ruby Support ............... SKIPPED
[INFO] Scala Script Engine ............................... SKIPPED
[INFO] Apache Sling Scala Scripting Configuration ........ SKIPPED
[INFO] Scala for Sling Demo Application - Hello World .... SKIPPED
[INFO] Scala for Sling Demo Application - Forum .......... SKIPPED
[INFO] Apache Sling Scripting Thymeleaf .................. SKIPPED
[INFO] Apache Sling Scripting Velocity Support ........... SKIPPED
[INFO] Apache Sling Scripting W3C XML Processing Support . SKIPPED
[INFO] Apache Sling NoSQL Generic Resource Provider ...... SKIPPED
[INFO] Apache Sling NoSQL Couchbase Client ............... SKIPPED
[INFO] Apache Sling NoSQL Couchbase Resource Provider .... SKIPPED
[INFO] Apache Sling NoSQL MongoDB Resource Provider ...... SKIPPED
[INFO] Apache Sling Launchpad Contrib Testing ............ SKIPPED
[INFO] Apache Sling Launchpad Karaf ...................... SKIPPED
[INFO] Apache Sling Launchpad Karaf - Features ........... SKIPPED
[INFO] Apache Sling Launchpad Karaf - Integration Tests .. SKIPPED
[INFO] Apache Sling Launchpad Karaf Builder .............. SKIPPED
[INFO] Apache Sling Contrib (Builder) .................... SKIPPED
[INFO] ------------------------------------------------------------------------
[INFO] BUILD FAILURE
[INFO] ------------------------------------------------------------------------
[INFO] Total time: 5:01.408s
[INFO] Finished at: Sun Oct 25 01:58:22 UTC 2015
[INFO] Final Memory: 80M/268M
[INFO] ------------------------------------------------------------------------
[JENKINS] Archiving disabled
[JENKINS] Archiving disabled
[JENKINS] Archiving disabled
[JENKINS] Archiving disabled
[JENKINS] Archiving disabled
[JENKINS] Archiving disabled
[JENKINS] Archiving disabled
[JENKINS] Archiving disabled
[JENKINS] Archiving disabled
[JENKINS] Archiving disabled
[JENKINS] Archiving disabled
[JENKINS] Archiving disabled
[JENKINS] Archiving disabled
[JENKINS] Archiving disabled
[JENKINS] Archiving disabled
[JENKINS] Archiving disabled
[JENKINS] Archiving disabled
[JENKINS] Archiving disabled
[JENKINS] Archiving disabled
[JENKINS] Archiving disabled
[JENKINS] Archiving disabled
[JENKINS] Archiving disabled
[JENKINS] Archiving disabled
[JENKINS] Archiving disabled
[JENKINS] Archiving disabled
[JENKINS] Archiving disabled
[JENKINS] Archiving disabled
[JENKINS] Archiving disabled
[JENKINS] Archiving disabled
[JENKINS] Archiving disabled
[JENKINS] Archiving disabled
[JENKINS] Archiving disabled
[JENKINS] Archiving disabled
[JENKINS] Archiving disabled
[JENKINS] Archiving disabled
[JENKINS] Archiving disabled
[JENKINS] Archiving disabled
[JENKINS] Archiving disabled
[JENKINS] Archiving disabled
[JENKINS] Archiving disabled
[JENKINS] Archiving disabled
[JENKINS] Archiving disabled
[JENKINS] Archiving disabled
[JENKINS] Archiving disabled
[JENKINS] Archiving disabled
[JENKINS] Archiving disabled
[JENKINS] Archiving disabled
[JENKINS] Archiving disabled
[JENKINS] Archiving disabled
[JENKINS] Archiving disabled
[JENKINS] Archiving disabled
[JENKINS] Archiving disabled
[JENKINS] Archiving disabled
[JENKINS] Archiving disabled
[JENKINS] Archiving disabled
[JENKINS] Archiving disabled
[JENKINS] Archiving disabled
[JENKINS] Archiving disabled
[JENKINS] Archiving disabled
[JENKINS] Archiving disabled
[JENKINS] Archiving disabled
[JENKINS] Archiving disabled
[JENKINS] Archiving disabled
[JENKINS] Archiving disabled
[JENKINS] Archiving disabled
[JENKINS] Archiving disabled
Waiting for Jenkins to finish collecting data
[ERROR] Failed to execute goal org.apache.rat:apache-rat-plugin:0.11:check (default) on project
org.apache.sling.distribution.it: Too many files with unapproved license: 1 See RAT report
in: <https://builds.apache.org/job/sling-contrib-1.7/ws/trunk/extensions/distribution/it/target/rat.txt>
-> [Help 1]
[ERROR] 
[ERROR] To see the full stack trace of the errors, re-run Maven with the -e switch.
[ERROR] Re-run Maven using the -X switch to enable full debug logging.
[ERROR] 
[ERROR] For more information about the errors and possible solutions, please read the following
articles:
[ERROR] [Help 1] http://cwiki.apache.org/confluence/display/MAVEN/MojoFailureException
[ERROR] 
[ERROR] After correcting the problems, you can resume the build with the command
[ERROR]   mvn <goals> -rf :org.apache.sling.distribution.it
channel stopped

Mime
View raw message