sling-commits mailing list archives

Site index · List index
Message view « Date » · « Thread »
Top « Date » · « Thread »
From Apache Jenkins Server <jenk...@builds.apache.org>
Subject Build failed in Jenkins: sling-trunk-1.7 #2306
Date Tue, 22 Sep 2015 15:37:57 GMT
See <https://builds.apache.org/job/sling-trunk-1.7/2306/changes>

Changes:

[stefanegli] SLING-5030 related : adding a sleep to make the test succeed on jenkins (2305)

[stefanegli] SLING-5030 related : adding a sleep to make the test succeed on jenkins (2305)

[stefanegli] SLING-5027 : avoid vote-loop introduced with SLING-3434 (through the votedAt
property) - by not voting again if already voted

------------------------------------------
[...truncated 97331 lines...]
[INFO] Apache Sling Scripting Sightly Engine ............. SUCCESS [19.146s]
[INFO] Apache Sling Scripting Sightly JavaScript Use Provider  SUCCESS [6.524s]
[INFO] Apache Sling Scripting Sightly Models Use Provider  SUCCESS [11.731s]
[INFO] Apache Sling Scripting Sightly Read-Eval-Print Loop Environment  SUCCESS [4.904s]
[INFO] Apache Sling Scripting Sightly Integration Tests Content  SUCCESS [7.705s]
[INFO] Apache Sling Adapter Manager Implementation ....... SUCCESS [10.290s]
[INFO] Apache Sling Launchpad Application Builder ........ SUCCESS [1:04.489s]
[INFO] Apache Sling Scripting Sightly Integration Tests .. SUCCESS [2:34.714s]
[INFO] Apache Sling Scripting Sightly Reactor ............ SUCCESS [2.882s]
[INFO] Apache Sling Bundle Resource Provider ............. SUCCESS [3.976s]
[INFO] Apache Sling Distributed Event Admin .............. SUCCESS [5.814s]
[INFO] Apache Sling Discovery API ........................ SUCCESS [6.634s]
[INFO] Apache Sling Discovery Commons Bundle ............. SUCCESS [5.189s]
[INFO] Apache Sling Resource-Based Discovery Service ..... SUCCESS [7:25.084s]
[INFO] Apache Sling Discovery Support Bundle ............. SUCCESS [5.164s]
[INFO] Apache Sling Discovery Standalone Implementation .. SUCCESS [5.809s]
[INFO] Apache Sling Event Support ........................ SUCCESS [11:52.777s]
[INFO] Apache Sling Feature Flags ........................ SUCCESS [6.833s]
[INFO] Apache Sling Filesystem Resource Provider ......... SUCCESS [5.230s]
[INFO] Apache Sling javax.activation bundle .............. SUCCESS [4.244s]
[INFO] Apache Sling Service User Mapper .................. SUCCESS [12.353s]
[INFO] Apache Sling Settings ............................. SUCCESS [6.681s]
[INFO] Apache Sling Web Console Branding ................. SUCCESS [8.184s]
[INFO] Apache Sling Web Console Security Provider ........ SUCCESS [5.142s]
[INFO] Apache Sling Explorer ............................. SUCCESS [4.585s]
[INFO] Apache Sling Health Check Core .................... SUCCESS [13.056s]
[INFO] Apache Sling Health Check Annotations ............. SUCCESS [19.182s]
[INFO] Apache Sling Health Check Samples ................. SUCCESS [6.298s]
[INFO] Apache Sling Health Check Support Components ...... SUCCESS [5.735s]
[INFO] Apache Sling Health Check Webconsole Plugin ....... SUCCESS [4.163s]
[INFO] Apache Sling Health Check JUnit Bridge ............ SUCCESS [5.830s]
[INFO] Apache Sling Health Check Integration Tests ....... SUCCESS [29.365s]
[INFO] Apache Sling Health Check Reactor POM ............. SUCCESS [2.060s]
[INFO] Apache Sling Resource Access Security ............. SUCCESS [4.446s]
[INFO] Apache Sling Test Tools ........................... SUCCESS [5.590s]
[INFO] Apache Sling Resource Access Security Integration Tests  SUCCESS [25.235s]
[INFO] Apache Sling Validation Framework API ............. SUCCESS [3.645s]
[INFO] Apache Sling Validation Framework Core Implementation  SUCCESS [8.357s]
[INFO] Apache Sling Validation Framework Testing Services  SUCCESS [5.734s]
[INFO] Apache Sling Validation Framework Integration Tests  SUCCESS [27.391s]
[INFO] Apache Sling Validation Framework Examples ........ SUCCESS [4.098s]
[INFO] Apache Sling Validation Framework Builder ......... SUCCESS [3.056s]
[INFO] Apache Sling Models API ........................... SUCCESS [5.955s]
[INFO] Apache Sling Models Implementation ................ SUCCESS [7.682s]
[INFO] Apache Sling Models Validation Implementation ..... SUCCESS [4.087s]
[INFO] Apache Sling Models Integration Tests ............. SUCCESS [36.683s]
[INFO] Apache Sling Internationalization Support ......... SUCCESS [35.632s]
[INFO] Apache Sling XSS Protection Bundle ................ SUCCESS [16.373s]
[INFO] Apache Sling JUnit Core ........................... SUCCESS [6.350s]
[INFO] Apache Sling JUnit Scriptable Tests Provider ...... SUCCESS [5.355s]
[INFO] Apache Sling JUnit Health Checks .................. SUCCESS [5.149s]
[INFO] Apache Sling JUnit Remote Tests Runners ........... SUCCESS [7.588s]
[INFO] Apache Sling JUnit Performance .................... SUCCESS [5.231s]
[INFO] Apache Sling JUnit Tests Teleporter ............... SUCCESS [9.140s]
[INFO] Apache Sling Testing Mock Log Configuration ....... SUCCESS [7.372s]
[INFO] Apache Sling Testing Resource Resolver Mock ....... SUCCESS [7.706s]
[INFO] Apache Sling Testing JCR Mock ..................... SUCCESS [6.152s]
[INFO] Apache Sling Testing OSGi Mock .................... SUCCESS [7.106s]
[INFO] Apache Sling Testing Sling Mock Jackrabbit-based Resource Resolver  SUCCESS [22.172s]
[INFO] Apache Sling Sample Server-Side Tests ............. SUCCESS [5.131s]
[INFO] Apache Sling Failing Server-Side Tests ............ SUCCESS [4.369s]
[INFO] Apache Sling Sample Integration Tests ............. SUCCESS [1:29.958s]
[INFO] Apache Sling Testing Modules Reactor .............. FAILURE [1.485s]
[INFO] Apache Sling Installer ............................ SKIPPED
[INFO] Apache Sling Installer WebConsole Plugin .......... SKIPPED
[INFO] Apache Sling File Installer ....................... SKIPPED
[INFO] Apache Sling JCR Installer ........................ SKIPPED
[INFO] Apache Sling Installer Configuration Admin Support  SKIPPED
[INFO] Apache Sling Deployment Package Installer ......... SKIPPED
[INFO] Apache Sling Subsystems Installer ................. SKIPPED
[INFO] Apache Sling Installer Integration Tests .......... SKIPPED
[INFO] Apache Sling Launchpad API ........................ SKIPPED
[INFO] Apache Sling Launchpad Base ....................... SKIPPED
[INFO] Apache Sling Launchpad Installer .................. SKIPPED
[INFO] Apache Sling Launchpad Content .................... SKIPPED
[INFO] Apache Sling Launchpad Testing Services ........... SKIPPED
[INFO] Apache Sling Launchpad Testing Services WAR ....... SKIPPED
[INFO] Apache Sling Launchpad Testing Fragment Bundle .... SKIPPED
[INFO] Apache Sling Launchpad Test Bundles ............... SKIPPED
[INFO] Apache Sling Integration Tests .................... SKIPPED
[INFO] Apache Sling Launchpad Testing .................... SKIPPED
[INFO] Apache Sling (Builder) ............................ SKIPPED
[INFO] ------------------------------------------------------------------------
[INFO] BUILD FAILURE
[INFO] ------------------------------------------------------------------------
[INFO] Total time: 48:10.140s
[INFO] Finished at: Tue Sep 22 15:37:38 UTC 2015
[INFO] Final Memory: 183M/450M
[INFO] ------------------------------------------------------------------------
[JENKINS] Archiving disabled
[JENKINS] Archiving disabled
[JENKINS] Archiving disabled
[JENKINS] Archiving disabled
[JENKINS] Archiving disabled
[JENKINS] Archiving disabled
[JENKINS] Archiving disabled
[JENKINS] Archiving disabled
[JENKINS] Archiving disabled
[JENKINS] Archiving disabled
[JENKINS] Archiving disabled
[JENKINS] Archiving disabled
[JENKINS] Archiving disabled
[JENKINS] Archiving disabled
[JENKINS] Archiving disabled
[JENKINS] Archiving disabled
[JENKINS] Archiving disabled
[JENKINS] Archiving disabled
[JENKINS] Archiving disabled
[JENKINS] Archiving disabled
[JENKINS] Archiving disabled
[JENKINS] Archiving disabled
[JENKINS] Archiving disabled
[JENKINS] Archiving disabled
[JENKINS] Archiving disabled
[JENKINS] Archiving disabled
[JENKINS] Archiving disabled
[JENKINS] Archiving disabled
[JENKINS] Archiving disabled
[JENKINS] Archiving disabled
[JENKINS] Archiving disabled
[JENKINS] Archiving disabled
[JENKINS] Archiving disabled
[JENKINS] Archiving disabled
[JENKINS] Archiving disabled
[JENKINS] Archiving disabled
[JENKINS] Archiving disabled
[JENKINS] Archiving disabled
[JENKINS] Archiving disabled
[JENKINS] Archiving disabled
[JENKINS] Archiving disabled
[JENKINS] Archiving disabled
[JENKINS] Archiving disabled
[JENKINS] Archiving disabled
[JENKINS] Archiving disabled
[JENKINS] Archiving disabled
[JENKINS] Archiving disabled
[JENKINS] Archiving disabled
[JENKINS] Archiving disabled
[JENKINS] Archiving disabled
[JENKINS] Archiving disabled
[JENKINS] Archiving disabled
[JENKINS] Archiving disabled
[JENKINS] Archiving disabled
[JENKINS] Archiving disabled
[JENKINS] Archiving disabled
[JENKINS] Archiving disabled
[JENKINS] Archiving disabled
[JENKINS] Archiving disabled
[JENKINS] Archiving disabled
[JENKINS] Archiving disabled
[JENKINS] Archiving disabled
[JENKINS] Archiving disabled
[JENKINS] Archiving disabled
[JENKINS] Archiving disabled
[JENKINS] Archiving disabled
[JENKINS] Archiving disabled
[JENKINS] Archiving disabled
[JENKINS] Archiving disabled
[JENKINS] Archiving disabled
[JENKINS] Archiving disabled
[JENKINS] Archiving disabled
[JENKINS] Archiving disabled
[JENKINS] Archiving disabled
[JENKINS] Archiving disabled
[JENKINS] Archiving disabled
[JENKINS] Archiving disabled
[JENKINS] Archiving disabled
[JENKINS] Archiving disabled
[JENKINS] Archiving disabled
[JENKINS] Archiving disabled
[JENKINS] Archiving disabled
[JENKINS] Archiving disabled
[JENKINS] Archiving disabled
[JENKINS] Archiving disabled
[JENKINS] Archiving disabled
[JENKINS] Archiving disabled
[JENKINS] Archiving disabled
[JENKINS] Archiving disabled
[JENKINS] Archiving disabled
[JENKINS] Archiving disabled
[JENKINS] Archiving disabled
[JENKINS] Archiving disabled
[JENKINS] Archiving disabled
[JENKINS] Archiving disabled
[JENKINS] Archiving disabled
[JENKINS] Archiving disabled
[JENKINS] Archiving disabled
[JENKINS] Archiving disabled
[JENKINS] Archiving disabled
[JENKINS] Archiving disabled
[JENKINS] Archiving disabled
[JENKINS] Archiving disabled
[JENKINS] Archiving disabled
[JENKINS] Archiving disabled
[JENKINS] Archiving disabled
[JENKINS] Archiving disabled
[JENKINS] Archiving disabled
[JENKINS] Archiving disabled
[JENKINS] Archiving disabled
[JENKINS] Archiving disabled
[JENKINS] Archiving disabled
[JENKINS] Archiving disabled
[JENKINS] Archiving disabled
[JENKINS] Archiving disabled
[JENKINS] Archiving disabled
[JENKINS] Archiving disabled
[JENKINS] Archiving disabled
[JENKINS] Archiving disabled
[JENKINS] Archiving disabled
[JENKINS] Archiving disabled
[JENKINS] Archiving disabled
[JENKINS] Archiving disabled
[JENKINS] Archiving disabled
[JENKINS] Archiving disabled
[JENKINS] Archiving disabled
[JENKINS] Archiving disabled
[JENKINS] Archiving disabled
[JENKINS] Archiving disabled
[JENKINS] Archiving disabled
[JENKINS] Archiving disabled
[JENKINS] Archiving disabled
[JENKINS] Archiving disabled
[JENKINS] Archiving disabled
[JENKINS] Archiving disabled
[JENKINS] Archiving disabled
[JENKINS] Archiving disabled
[JENKINS] Archiving disabled
[JENKINS] Archiving disabled
[JENKINS] Archiving disabled
[JENKINS] Archiving disabled
[JENKINS] Archiving disabled
[JENKINS] Archiving disabled
[JENKINS] Archiving disabled
[JENKINS] Archiving disabled
[JENKINS] Archiving disabled
[JENKINS] Archiving disabled
[JENKINS] Archiving disabled
Waiting for Jenkins to finish collecting data
[ERROR] Failed to execute goal org.apache.rat:apache-rat-plugin:0.11:check (default) on project
org.apache.sling.testing.reactor: Too many files with unapproved license: 5 See RAT report
in: <https://builds.apache.org/job/sling-trunk-1.7/ws/trunk/testing/target/rat.txt>
-> [Help 1]
[ERROR] 
[ERROR] To see the full stack trace of the errors, re-run Maven with the -e switch.
[ERROR] Re-run Maven using the -X switch to enable full debug logging.
[ERROR] 
[ERROR] For more information about the errors and possible solutions, please read the following
articles:
[ERROR] [Help 1] http://cwiki.apache.org/confluence/display/MAVEN/MojoFailureException
[ERROR] 
[ERROR] After correcting the problems, you can resume the build with the command
[ERROR]   mvn <goals> -rf :org.apache.sling.testing.reactor
channel stopped

Mime
View raw message