sling-commits mailing list archives

Site index · List index
Message view « Date » · « Thread »
Top « Date » · « Thread »
From Apache Jenkins Server <jenk...@builds.apache.org>
Subject Build failed in Jenkins: sling-trunk-1.8 #1604
Date Wed, 23 Sep 2015 12:47:07 GMT
See <https://builds.apache.org/job/sling-trunk-1.8/1604/changes>

Changes:

[bdelacretaz] SLING-5040 - remove unused constant

------------------------------------------
[...truncated 100742 lines...]
[INFO] Apache Sling Scripting Sightly Engine ............. SUCCESS [11.216s]
[INFO] Apache Sling Scripting Sightly JavaScript Use Provider  SUCCESS [3.165s]
[INFO] Apache Sling Scripting Sightly Models Use Provider  SUCCESS [2.471s]
[INFO] Apache Sling Scripting Sightly Read-Eval-Print Loop Environment  SUCCESS [2.309s]
[INFO] Apache Sling Scripting Sightly Integration Tests Content  SUCCESS [5.994s]
[INFO] Apache Sling Adapter Manager Implementation ....... SUCCESS [3.560s]
[INFO] Apache Sling Launchpad Application Builder ........ SUCCESS [21.114s]
[INFO] Apache Sling Scripting Sightly Integration Tests .. SUCCESS [2:10.425s]
[INFO] Apache Sling Scripting Sightly Reactor ............ SUCCESS [1.229s]
[INFO] Apache Sling Bundle Resource Provider ............. SUCCESS [3.024s]
[INFO] Apache Sling Distributed Event Admin .............. SUCCESS [2.994s]
[INFO] Apache Sling Discovery API ........................ SUCCESS [2.888s]
[INFO] Apache Sling Discovery Commons Bundle ............. SUCCESS [2.713s]
[INFO] Apache Sling Resource-Based Discovery Service ..... SUCCESS [7:14.258s]
[INFO] Apache Sling Discovery Support Bundle ............. SUCCESS [3.657s]
[INFO] Apache Sling Discovery Standalone Implementation .. SUCCESS [5.332s]
[INFO] Apache Sling Event Support ........................ SUCCESS [16:34.724s]
[INFO] Apache Sling Feature Flags ........................ SUCCESS [4.544s]
[INFO] Apache Sling Filesystem Resource Provider ......... SUCCESS [3.412s]
[INFO] Apache Sling javax.activation bundle .............. SUCCESS [4.903s]
[INFO] Apache Sling Service User Mapper .................. SUCCESS [6.430s]
[INFO] Apache Sling Settings ............................. SUCCESS [5.836s]
[INFO] Apache Sling Web Console Branding ................. SUCCESS [3.447s]
[INFO] Apache Sling Web Console Security Provider ........ SUCCESS [5.322s]
[INFO] Apache Sling Explorer ............................. SUCCESS [4.067s]
[INFO] Apache Sling Health Check Core .................... SUCCESS [13.029s]
[INFO] Apache Sling Health Check Annotations ............. SUCCESS [5.260s]
[INFO] Apache Sling Health Check Samples ................. SUCCESS [5.466s]
[INFO] Apache Sling Health Check Support Components ...... SUCCESS [3.835s]
[INFO] Apache Sling Health Check Webconsole Plugin ....... SUCCESS [5.291s]
[INFO] Apache Sling Health Check JUnit Bridge ............ SUCCESS [3.807s]
[INFO] Apache Sling Health Check Integration Tests ....... SUCCESS [26.324s]
[INFO] Apache Sling Health Check Reactor POM ............. SUCCESS [6.348s]
[INFO] Apache Sling Resource Access Security ............. SUCCESS [2.980s]
[INFO] Apache Sling Test Tools ........................... SUCCESS [3.412s]
[INFO] Apache Sling Resource Access Security Integration Tests  SUCCESS [28.176s]
[INFO] Apache Sling Validation Framework API ............. SUCCESS [2.902s]
[INFO] Apache Sling Validation Framework Core Implementation  SUCCESS [7.608s]
[INFO] Apache Sling Validation Framework Testing Services  SUCCESS [2.983s]
[INFO] Apache Sling Validation Framework Integration Tests  SUCCESS [22.513s]
[INFO] Apache Sling Validation Framework Examples ........ SUCCESS [3.925s]
[INFO] Apache Sling Validation Framework Builder ......... SUCCESS [1.955s]
[INFO] Apache Sling Models API ........................... SUCCESS [2.981s]
[INFO] Apache Sling Models Implementation ................ SUCCESS [8.422s]
[INFO] Apache Sling Models Validation Implementation ..... SUCCESS [3.435s]
[INFO] Apache Sling Models Integration Tests ............. SUCCESS [34.729s]
[INFO] Apache Sling Internationalization Support ......... SUCCESS [40.356s]
[INFO] Apache Sling XSS Protection Bundle ................ SUCCESS [11.934s]
[INFO] Apache Sling JUnit Core ........................... SUCCESS [4.515s]
[INFO] Apache Sling JUnit Scriptable Tests Provider ...... SUCCESS [3.125s]
[INFO] Apache Sling JUnit Health Checks .................. SUCCESS [2.716s]
[INFO] Apache Sling JUnit Remote Tests Runners ........... SUCCESS [3.019s]
[INFO] Apache Sling JUnit Performance .................... SUCCESS [5.420s]
[INFO] Apache Sling JUnit Tests Teleporter ............... SUCCESS [2.390s]
[INFO] Apache Sling Testing Mock Log Configuration ....... SUCCESS [2.273s]
[INFO] Apache Sling Testing Resource Resolver Mock ....... SUCCESS [2.903s]
[INFO] Apache Sling Testing JCR Mock ..................... SUCCESS [3.632s]
[INFO] Apache Sling Testing OSGi Mock .................... SUCCESS [5.408s]
[INFO] Apache Sling Testing Sling Mock Jackrabbit-based Resource Resolver  SUCCESS [25.107s]
[INFO] Apache Sling Sample Server-Side Tests ............. SUCCESS [2.456s]
[INFO] Apache Sling Failing Server-Side Tests ............ SUCCESS [2.129s]
[INFO] Apache Sling Sample Integration Tests ............. SUCCESS [1:58.055s]
[INFO] Apache Sling Testing Modules Reactor .............. FAILURE [2.128s]
[INFO] Apache Sling Installer ............................ SKIPPED
[INFO] Apache Sling Installer WebConsole Plugin .......... SKIPPED
[INFO] Apache Sling File Installer ....................... SKIPPED
[INFO] Apache Sling JCR Installer ........................ SKIPPED
[INFO] Apache Sling Installer Configuration Admin Support  SKIPPED
[INFO] Apache Sling Deployment Package Installer ......... SKIPPED
[INFO] Apache Sling Subsystems Installer ................. SKIPPED
[INFO] Apache Sling Installer Integration Tests .......... SKIPPED
[INFO] Apache Sling Launchpad API ........................ SKIPPED
[INFO] Apache Sling Launchpad Base ....................... SKIPPED
[INFO] Apache Sling Launchpad Installer .................. SKIPPED
[INFO] Apache Sling Launchpad Content .................... SKIPPED
[INFO] Apache Sling Launchpad Testing Services ........... SKIPPED
[INFO] Apache Sling Launchpad Testing Services WAR ....... SKIPPED
[INFO] Apache Sling Launchpad Testing Fragment Bundle .... SKIPPED
[INFO] Apache Sling Launchpad Test Bundles ............... SKIPPED
[INFO] Apache Sling Integration Tests .................... SKIPPED
[INFO] Apache Sling Launchpad Testing .................... SKIPPED
[INFO] Apache Sling (Builder) ............................ SKIPPED
[INFO] ------------------------------------------------------------------------
[INFO] BUILD FAILURE
[INFO] ------------------------------------------------------------------------
[INFO] Total time: 46:47.639s
[INFO] Finished at: Wed Sep 23 12:46:46 UTC 2015
[INFO] Final Memory: 193M/471M
[INFO] ------------------------------------------------------------------------
[JENKINS] Archiving disabled
[JENKINS] Archiving disabled
[JENKINS] Archiving disabled
[JENKINS] Archiving disabled
[JENKINS] Archiving disabled
[JENKINS] Archiving disabled
[JENKINS] Archiving disabled
[JENKINS] Archiving disabled
[JENKINS] Archiving disabled
[JENKINS] Archiving disabled
[JENKINS] Archiving disabled
[JENKINS] Archiving disabled
[JENKINS] Archiving disabled
[JENKINS] Archiving disabled
[JENKINS] Archiving disabled
[JENKINS] Archiving disabled
[JENKINS] Archiving disabled
[JENKINS] Archiving disabled
[JENKINS] Archiving disabled
[JENKINS] Archiving disabled
[JENKINS] Archiving disabled
[JENKINS] Archiving disabled
[JENKINS] Archiving disabled
[JENKINS] Archiving disabled
[JENKINS] Archiving disabled
[JENKINS] Archiving disabled
[JENKINS] Archiving disabled
[JENKINS] Archiving disabled
[JENKINS] Archiving disabled
[JENKINS] Archiving disabled
[JENKINS] Archiving disabled
[JENKINS] Archiving disabled
[JENKINS] Archiving disabled
[JENKINS] Archiving disabled
[JENKINS] Archiving disabled
[JENKINS] Archiving disabled
[JENKINS] Archiving disabled
[JENKINS] Archiving disabled
[JENKINS] Archiving disabled
[JENKINS] Archiving disabled
[JENKINS] Archiving disabled
[JENKINS] Archiving disabled
[JENKINS] Archiving disabled
[JENKINS] Archiving disabled
[JENKINS] Archiving disabled
[JENKINS] Archiving disabled
[JENKINS] Archiving disabled
[JENKINS] Archiving disabled
[JENKINS] Archiving disabled
[JENKINS] Archiving disabled
[JENKINS] Archiving disabled
[JENKINS] Archiving disabled
[JENKINS] Archiving disabled
[JENKINS] Archiving disabled
[JENKINS] Archiving disabled
[JENKINS] Archiving disabled
[JENKINS] Archiving disabled
[JENKINS] Archiving disabled
[JENKINS] Archiving disabled
[JENKINS] Archiving disabled
[JENKINS] Archiving disabled
[JENKINS] Archiving disabled
[JENKINS] Archiving disabled
[JENKINS] Archiving disabled
[JENKINS] Archiving disabled
[JENKINS] Archiving disabled
[JENKINS] Archiving disabled
[JENKINS] Archiving disabled
[JENKINS] Archiving disabled
[JENKINS] Archiving disabled
[JENKINS] Archiving disabled
[JENKINS] Archiving disabled
[JENKINS] Archiving disabled
[JENKINS] Archiving disabled
[JENKINS] Archiving disabled
[JENKINS] Archiving disabled
[JENKINS] Archiving disabled
[JENKINS] Archiving disabled
[JENKINS] Archiving disabled
[JENKINS] Archiving disabled
[JENKINS] Archiving disabled
[JENKINS] Archiving disabled
[JENKINS] Archiving disabled
[JENKINS] Archiving disabled
[JENKINS] Archiving disabled
[JENKINS] Archiving disabled
[JENKINS] Archiving disabled
[JENKINS] Archiving disabled
[JENKINS] Archiving disabled
[JENKINS] Archiving disabled
[JENKINS] Archiving disabled
[JENKINS] Archiving disabled
[JENKINS] Archiving disabled
[JENKINS] Archiving disabled
[JENKINS] Archiving disabled
[JENKINS] Archiving disabled
[JENKINS] Archiving disabled
[JENKINS] Archiving disabled
[JENKINS] Archiving disabled
[JENKINS] Archiving disabled
[JENKINS] Archiving disabled
[JENKINS] Archiving disabled
[JENKINS] Archiving disabled
[JENKINS] Archiving disabled
[JENKINS] Archiving disabled
[JENKINS] Archiving disabled
[JENKINS] Archiving disabled
[JENKINS] Archiving disabled
[JENKINS] Archiving disabled
[JENKINS] Archiving disabled
[JENKINS] Archiving disabled
[JENKINS] Archiving disabled
[JENKINS] Archiving disabled
[JENKINS] Archiving disabled
[JENKINS] Archiving disabled
[JENKINS] Archiving disabled
[JENKINS] Archiving disabled
[JENKINS] Archiving disabled
[JENKINS] Archiving disabled
[JENKINS] Archiving disabled
[JENKINS] Archiving disabled
[JENKINS] Archiving disabled
[JENKINS] Archiving disabled
[JENKINS] Archiving disabled
[JENKINS] Archiving disabled
[JENKINS] Archiving disabled
[JENKINS] Archiving disabled
[JENKINS] Archiving disabled
[JENKINS] Archiving disabled
[JENKINS] Archiving disabled
[JENKINS] Archiving disabled
[JENKINS] Archiving disabled
[JENKINS] Archiving disabled
[JENKINS] Archiving disabled
[JENKINS] Archiving disabled
[JENKINS] Archiving disabled
[JENKINS] Archiving disabled
[JENKINS] Archiving disabled
[JENKINS] Archiving disabled
[JENKINS] Archiving disabled
[JENKINS] Archiving disabled
[JENKINS] Archiving disabled
[JENKINS] Archiving disabled
[JENKINS] Archiving disabled
[JENKINS] Archiving disabled
[JENKINS] Archiving disabled
[JENKINS] Archiving disabled
[JENKINS] Archiving disabled
Waiting for Jenkins to finish collecting data
[ERROR] Failed to execute goal org.apache.rat:apache-rat-plugin:0.11:check (default) on project
org.apache.sling.testing.reactor: Too many files with unapproved license: 5 See RAT report
in: <https://builds.apache.org/job/sling-trunk-1.8/ws/trunk/testing/target/rat.txt>
-> [Help 1]
[ERROR] 
[ERROR] To see the full stack trace of the errors, re-run Maven with the -e switch.
[ERROR] Re-run Maven using the -X switch to enable full debug logging.
[ERROR] 
[ERROR] For more information about the errors and possible solutions, please read the following
articles:
[ERROR] [Help 1] http://cwiki.apache.org/confluence/display/MAVEN/MojoFailureException
[ERROR] 
[ERROR] After correcting the problems, you can resume the build with the command
[ERROR]   mvn <goals> -rf :org.apache.sling.testing.reactor
channel stopped

Mime
View raw message